Peptide,PTM,ModifiedAA,ModifiedPosition,PeptideUniqueToGene,ExperimentDesc,ExpID,PubmedID,ScoreType,IdentScore,LocProb,Log2FChange,PQ-val,QuantSig,PEP,MassErrorPPM
SSESPNLPAAAGTVPDNHPPPPPVVTAAEAGSDDSPK,ph,S,2,true,"Lateral root-induction - NAA vs control",106,23328941,"MASCOT Score",35.0000000,,,,,,
SSESPNLPAAAGTVPDNHPPPPPVVTAAEAGSDDSPK,ph,S,5,true,"Lateral root-induction - NAA vs control",106,23328941,"MASCOT Score",43.0000000,,,,,,
SSESPNLPAAAGTVPDNHPPPPPVVTAAEAGSDDSPK,ph,T,14,true,"Lateral root-induction - NAA vs control",106,23328941,"MASCOT Score",47.0000000,,,,,,
SSESPNLPAAAGTVPDNHPPPPPVVTAAEAGSDDSPKGVASK,ph,S,36,true,"Phospho cell culture sucrose/TOR",109,30833711,,,0.8974380,,,,,
SSESPNLPAAAGTVPDNHPPPPPVVTAAEAGSDDSPK,ph,S,36,true,"Tissue atlas Arabidopsis - ProteomicsDB",114,32188942,"MaxQuant score",138.4900000,0.9470820,,,,0,
LSAAGISNWAK,ph,S,45,true,"Tissue atlas Arabidopsis - ProteomicsDB",114,32188942,"MaxQuant score",159.7700000,0.9997660,,,,1.6624799681429E-13,
VPQPFASTQNDSGVENTEK,ph,S,69,true,"Tissue atlas Arabidopsis - ProteomicsDB",114,32188942,"MaxQuant score",76.1760000,0.9923800,,,,0.00017136200040113,
FTSGLGIR,ph,S,84,true,"atm and atr DNA damage response",88,25561503,"MASCOT Score",27.0000000,0.9950000,,,,,0.1100000
FTSGLGIR,ph,S,84,true,"Tissue atlas Arabidopsis - ProteomicsDB",114,32188942,"MaxQuant score",125.8300000,0.9999630,,,,0.0018195400480181,
FTSGLGIRLSPK,ph,S,91,true,"STN8 phosphoproteome",38,21768351,"MASCOT Score",53.2300000,,,,,,-0.7255630
FTSGLGIRLSPK,ph,S,91,true,"MAPK Arabidopsis substrates",45,23172892,"MaxQuant Score",191.2900000,,,,,,
FTSGLGIRLSPK,ph,S,91,true,"Chloroplast kinase substrates",60,19376835,"MASCOT Score",46.9300000,,,,,,-0.0179716
FTSGLGIRLSPK,ph,S,91,true,"TOR Kinase and ABA Receptor",100,29290610,XCorr,3.2354145,1.0000000,,,,0.0011540000559762,
FTSGLGIRLSPK,ph,S,91,true,"Tissue atlas Arabidopsis - ProteomicsDB",114,32188942,"MaxQuant score",202.3200000,1.0000000,,,,2.1946400536632E-30,
FTSGLGIRLSPK,ph,S,91,true,"Touch-induced phosphorylation: 40s touch vs untouc",136,30291188,"MASCOT score",59.0800000,,-0.1480496,0.6752054,NO,,5.9041877
LSPKSPQTNDTTTEGTSSATESSFIGTITK,ph,S,94,true,"Tissue atlas Arabidopsis - ProteomicsDB",114,32188942,"MaxQuant score",121.2600000,0.9830520,,,,4.2319213622609E-43,
LSPKSPQTNDTTTEGTSSATESSFIGTITK,fuc,T,105,true,"SPINDLY O-fucosylation",162,36739885,,,,,,,1,
SPQTNDTTTEGTSSATESSFIGTITK,fuc,T,105,true,"SPINDLY O-fucosylation",162,36739885,,,,,,,1,
VILKTSELDGFDKR,ac,K,432,true,"Quantitative Acetylproteomics",101,29440448,,,,,,,,
TSELDGFDKR,ac,K,441,true,"Quantitative Acetylproteomics",101,29440448,,,,,,,,
TPEETSAANSSPVDGSASVPGPDK,ph,S,484,true,"Tissue atlas Arabidopsis - ProteomicsDB",114,32188942,"MaxQuant score",306.8800000,0.9990340,,,,0,
TPEETSAANSSPVDGSASVPGPDK,ph,S,489,true,"Tissue atlas Arabidopsis - ProteomicsDB",114,32188942,"MaxQuant score",119.3800000,0.8370890,,,,1.317759940623E-26,
TPEETSAANSSPVDGSASVPGPDKETENPDKDDVFSDNEGDSTGPTK,ph,S,509,true,"STN8 phosphoproteome",38,21768351,"MASCOT Score",53.7700000,,,,,,-1.0560300
TPEETSAANSSPVDGSASVPGPDKETENPDKDDVFSDNEGDSTGPTK,ph,S,509,true,"PAMP-triggered phosphorylation",48,24601666,"MASCOT Score",46.8300000,,,,,,
TPEETSAANSSPVDGSASVPGPDKETENPDKDDVFSDNEGDSTGPTK,ph,S,509,true,"Chloroplast kinase substrates",60,19376835,"MASCOT Score",46.4500000,,,,,,-0.0685949
TPEETSAANSSPVDGSASVPGPDKETENPDKDDVFSDNEGDSTGPTK,ph,S,509,true,"LAXIC - mannitol vs control",84b,23660473,XCorr,5.5800000,0.7580000,,,,0.00058657099725679,
ETENPDKDDVFSDNEGDSTGPTK,ph,S,509,true,"STN8 phosphoproteome",38,21768351,"MASCOT Score",90.6300000,,,,,,-1.0474600
ETENPDKDDVFSDNEGDSTGPTK,ph,S,509,true,"Chloroplast kinase substrates",60,19376835,"MASCOT Score",67.6000000,,,,,,-1.0716900
ETENPDKDDVFSDNEGDSTGPTK,ph,S,509,true,"srk2dei ABA signaling phopshoproteomics",83,23572148,"MASCOT Score",89.0000000,,,,,,-0.0037000
ETENPDKDDVFSDNEGDSTGPTK,ph,S,509,true,"LAXIC - ABA stress",84a,23660473,XCorr,5.7300000,0.9990000,,,,0.00066241098102182,
ETENPDKDDVFSDNEGDSTGPTK,ph,S,509,true,"LAXIC - mannitol vs control",84b,23660473,XCorr,6.1000000,0.9990000,,,,2.5500000901957E-6,
ETENPDKDDVFSDNEGDSTGPTK,ph,S,509,true,"SnRK2 protein kinase substrates",85,23776212,XCorr,4.5324588,1.0000000,,,,4.0357999060714E-12,
ETENPDKDDVFSDNEGDSTGPTK,ph,S,509,true,"Brassinosteroid-Regulated Phosphorylation Dynamics",94,26187819,"MaxQuant Score",173.3500000,1.0000000,,,,6.3369997999084E-23,1.4260000
ETENPDKDDVFSDNEGDSTGPTK,ph,S,509,true,"TOR Kinase and ABA Receptor",100,29290610,XCorr,4.8087516,1.0000000,,,,9.0800003818003E-6,
ETENPDKDDVFSDNEGDSTGPTK,ph,S,509,true,"Col-0 callus - FC Col-0 vs. Col-0 Xray",111a,31410901,,60.8300000,,1.0484653,0.0475712,YES,,1.0110016
ETENPDKDDVFSDNEGDSTGPTK,ph,S,509,true,"Col-0 X-ray callus - FC Col-0 vs. Col-0 Xray",111b,31410901,,60.8300000,,1.0484653,0.0475712,YES,,1.0110016
ETENPDKDDVFSDNEGDSTGPTK,ph,S,509,true,"atm callus - FC atm vs. atm Xray",111c,31410901,,60.8300000,,0.8111652,0.1658286,NO,,1.0110016
ETENPDKDDVFSDNEGDSTGPTK,ph,S,509,true,"atm-3 X-ray callus - FC atm vs. atm Xray",111d,31410901,,60.8300000,,0.8111652,0.1658286,NO,,1.0110016
ETENPDKDDVFSDNEGDSTGPTK,ph,S,509,true,"Tissue atlas Arabidopsis - ProteomicsDB",114,32188942,"MaxQuant score",563.6300000,1.0000000,,,,0,
DDVFSDNEGDSTGPTK,ph,S,509,true,"STN8 phosphoproteome",38,21768351,"MASCOT Score",47.5300000,,,,,,0.7353310
DDVFSDNEGDSTGPTK,ph,S,509,true,"BSK8 and BSL2 regulating sucrose-ph synthase",66,24924143,"MaxQuant Score",202.2200000,,,,,,0.8760300
DDVFSDNEGDSTGPTK,ph,S,509,true,"srk2dei ABA signaling phopshoproteomics",83,23572148,"MASCOT Score",99.0000000,,,,,,0.0002000
DDVFSDNEGDSTGPTK,ph,S,509,true,"TOR Kinase and ABA Receptor",100,29290610,XCorr,4.8308177,1.0000000,,,,9.6879997357746E-9,
TTSSASSQTPEAK,ph,S,523,true,"Tissue atlas Arabidopsis - ProteomicsDB",114,32188942,"MaxQuant score",153.1500000,0.9986400,,,,1.4502599299249E-7,
TTSSASSQTPEAK,ph,T,529,true,"atm and atr DNA damage response",88,25561503,"MASCOT Score",70.0000000,0.9460000,,,,,0.0900000
TTSSASSQTPEAK,ph,T,529,true,"Tissue atlas Arabidopsis - ProteomicsDB",114,32188942,"MaxQuant score",191.5700000,0.9999990,,,,7.9298796244325E-30,
KSADETAVLTK,ph,S,535,true,"atm and atr DNA damage response",88,25561503,"MASCOT Score",44.0000000,1.0000000,,,,,-2.0800000
KSADETAVLTK,ph,S,535,true,"Tissue atlas Arabidopsis - ProteomicsDB",114,32188942,"MaxQuant score",178.1400000,0.9999790,,,,4.7493899682201E-14,
KSADETAVLTK,ph,T,539,true,"Tissue atlas Arabidopsis - ProteomicsDB",114,32188942,"MaxQuant score",175.4300000,1.0000000,,,,1.0335899670866E-11,
ATEKVSISGNK,ph,S,550,true,"Tissue atlas Arabidopsis - ProteomicsDB",114,32188942,"MaxQuant score",259.2700000,0.9996160,,,,0,
VSISGNKGSSQPVQGVTVSK,ph,S,557,true,"Tissue atlas Arabidopsis - ProteomicsDB",114,32188942,"MaxQuant score",110.3100000,0.7840240,,,,3.1194599854623E-12,
GSSQPVQGVTVSK,ph,S,558,true,"atm and atr DNA damage response",88,25561503,"MASCOT Score",31.0000000,0.9390000,,,,,-1.3300000
GSSQPVQGVTVSK,ph,S,558,true,"Tissue atlas Arabidopsis - ProteomicsDB",114,32188942,"MaxQuant score",134.4300000,0.9986940,,,,3.1194599854623E-12,
GEATEKPSGAGVNASSSSESEFK,ph,S,576,true,"Tissue atlas Arabidopsis - ProteomicsDB",114,32188942,"MaxQuant score",87.6710000,0.9796910,,,,9.9587904589526E-10,
GEATEKPSGAGVNASSSSESEFK,ph,S,584,true,"Tissue atlas Arabidopsis - ProteomicsDB",114,32188942,"MaxQuant score",267.8100000,0.9575810,,,,0,
GEATEKPSGAGVNASSSSESEFK,ph,S,586,true,"Tissue atlas Arabidopsis - ProteomicsDB",114,32188942,"MaxQuant score",151.0600000,0.8373050,,,,1.738050016488E-34,
VMAADASVFSFGDEDDFESD,ph,S,601,true,"srk2dei ABA signaling phopshoproteomics",83,23572148,"MASCOT Score",32.0000000,,,,,,-0.0007000
VMAADASVFSFGDEDDFESD,ph,S,610,true,"Pollen phosphoproteome Arabidopsis",43,22631563,"MASCOT Score",37.6500000,,,,,,
VMAADASVFSFGDEDDFESD,ph,S,610,true,"Chloroplast kinase substrates",60,19376835,"MASCOT Score",42.1600000,,,,,,-0.9287210
VMAADASVFSFGDEDDFESD,ph,S,610,true,"Conserved plant phosphoproteome - Arabidopsis",61a,20466843,"MASCOT Score",20.0000000,1.0000000,,,,,
VMAADASVFSFGDEDDFESD,ph,S,610,true,"srk2dei ABA signaling phopshoproteomics",83,23572148,"MASCOT Score",75.0000000,,,,,,-0.0016000
VMAADASVFSFGDEDDFESD,ph,S,610,true,"atm and atr DNA damage response",88,25561503,"MASCOT Score",33.0000000,1.0000000,,,,,0.4600000
VMAADASVFSFGDEDDFESD,ph,S,610,true,"Brassinosteroid-Regulated Phosphorylation Dynamics",94,26187819,"MaxQuant Score",306.6900000,1.0000000,,,,0,-1.1930000
VMAADASVFSFGDEDDFESD,ph,S,610,true,"TOR Kinase and ABA Receptor",100,29290610,XCorr,6.3095036,1.0000000,,,,5.8929999768864E-10,
VMAADASVFSFGDEDDFESD,ph,S,610,true,"Lateral root-induction - NAA vs control",106,23328941,"MASCOT Score",51.0000000,,,,,,
