Peptide,PTM,ModifiedAA,ModifiedPosition,PeptideUniqueToGene,ExperimentDesc,ExpID,PubmedID,ScoreType,IdentScore,LocProb,Log2FChange,PQ-val,QuantSig,PEP,MassErrorPPM
SLSEKLETVALNSPK,ph,S,47,true,"Phosphorylation Early Elicitor Signaling",23,17317660,,,,,,,,
SLSEKLETVALNSPK,ph,S,47,true,"Tissue atlas Arabidopsis - ProteomicsDB",114,32188942,"MaxQuant score",208.5900000,0.9973020,,,,4.2038953929745E-45,
SLSEKLETVALNSPKK,ph,S,59,true,"Tissue atlas Arabidopsis - ProteomicsDB",114,32188942,"MaxQuant score",239.8000000,1.0000000,,,,0,
SLSEKLETVALNSPK,ph,S,59,true,"Phosphorylation Early Elicitor Signaling",23,17317660,,,,,,,,
LETVALNSPKK,ph,S,59,true,"Large-scale phosphorylation discovery",44,23111157,XCorr,2.6510000,,,,,,
LETVALNSPKK,ph,S,59,true,"atm and atr DNA damage response",88,25561503,"MASCOT Score",50.0000000,1.0000000,,,,,-2.0100000
LETVALNSPKK,ph,S,59,true,"TOR Kinase and ABA Receptor",100,29290610,XCorr,3.2905471,1.0000000,,,,0.00071870000101626,
LETVALNSPK,ph,S,59,true,"Large-scale phosphorylation discovery",44,23111157,XCorr,2.8470000,,,,,,
LETVALNSPK,ph,S,59,true,"atm and atr DNA damage response",88,25561503,"MASCOT Score",67.0000000,1.0000000,,,,,-1.8700000
LETVALNSPK,ph,S,59,true,"TOR Kinase and ABA Receptor",100,29290610,XCorr,2.9185700,1.0000000,,,,0.0014750000555068,
NGESSPFCGVSDK,ph,S,97,true,"Tissue atlas Arabidopsis - ProteomicsDB",114,32188942,"MaxQuant score",94.6730000,0.7947810,,,,0.00027689299895428,
SIESMKK,ph,S,132,true,"Tissue atlas Arabidopsis - ProteomicsDB",114,32188942,"MaxQuant score",95.5230000,1.0000000,,,,0.008620229549706,
SISMRNEGEEK,ph,S,267,true,"Tissue atlas Arabidopsis - ProteomicsDB",114,32188942,"MaxQuant score",54.8980000,0.9970940,,,,0.0051352698355913,
GQKPLEASSFDIQSESSVMSPCGSK,ph,S,349,true,"Tissue atlas Arabidopsis - ProteomicsDB",114,32188942,"MaxQuant score",75.0350000,0.9691240,,,,2.2356099194099E-9,
GQKPLEASSFDIQSESSVMSPCGSK,ph,S,355,true,"Tissue atlas Arabidopsis - ProteomicsDB",114,32188942,"MaxQuant score",104.0700000,0.9906840,,,,2.574660040756E-17,
NGWDIATASVK,ph,S,596,true,"Tissue atlas Arabidopsis - ProteomicsDB",114,32188942,"MaxQuant score",100.7300000,0.8206870,,,,7.9985598858912E-5,
ALSTTETSSTIK,ph,S,617,true,"Tissue atlas Arabidopsis - ProteomicsDB",114,32188942,"MaxQuant score",110.9100000,0.9802750,,,,0.00016573000175413,
RSSLRENIAEDDTNR,ph,S,632,true,"Large-scale phosphorylation discovery",44,23111157,XCorr,3.2930000,,,,,,
RSSLRENIAEDDTNR,ph,S,632,true,"TOR Kinase and ABA Receptor",100,29290610,XCorr,4.4259357,1.0000000,,,,6.3510001382383E-6,
RSSLRENIAEDDTNR,ph,S,632,true,"Tissue atlas Arabidopsis - ProteomicsDB",114,32188942,"MaxQuant score",112.3000000,1.0000000,,,,3.9272199501283E-6,
SSLRENIAEDDTNR,ph,S,632,true,"atm and atr DNA damage response",88,25561503,"MASCOT Score",35.0000000,1.0000000,,,,,-0.4300000
RSSLRENIAEDDTNR,ph,S,633,true,"atm and atr DNA damage response",88,25561503,"MASCOT Score",35.0000000,0.9090000,,,,,-0.0900000
RSSLRENIAEDDTNR,ph,S,633,true,"TOR Kinase and ABA Receptor",100,29290610,XCorr,4.4259357,1.0000000,,,,6.3510001382383E-6,
RSSLRENIAEDDTNR,ph,S,633,true,"Tissue atlas Arabidopsis - ProteomicsDB",114,32188942,"MaxQuant score",108.0800000,1.0000000,,,,3.9272199501283E-6,
SSLRENIAEDDTNR,ph,S,633,true,"atm and atr DNA damage response",88,25561503,"MASCOT Score",47.0000000,0.9570000,,,,,-0.5700000
