Peptide,PTM,ModifiedAA,ModifiedPosition,PeptideUniqueToGene,ExperimentDesc,ExpID,PubmedID,ScoreType,IdentScore,LocProb,Log2FChange,PQ-val,QuantSig,PEP,MassErrorPPM
AVATQPAPLYPDVGQDE,nt,A,85,true,"N-terminal ChaFRADIC",92,26010716,"MASCOT Score",57.3600000,,,,,2.1669999128449E-8,
AVATQPAPLYPDVGQDE,nt,A,85,true,"Arg/N-end rule seed, prt6 vs. Wt",99,29168982,"MASCOT Score",45.0100000,,-0.0967437,0.5214181,NO,0.00047749999794178,-1.9429351
AVATQPAPLYPDVGQDE,nt,A,85,true,"HUNTER N-terminome: legumain, GluC and trypsin",119,31951383,"MaxQuant score",124.4200000,,,,,,
AVATQPAPLYPDVGQD,nt,A,85,true,"HUNTER N-terminome: legumain, GluC and trypsin",119,31951383,"MaxQuant score",83.0870000,,,,,,
AVATQPAPLYPDVGQDE,nta,A,85,true,"HUNTER N-terminome: legumain, GluC and trypsin",119,31951383,"MaxQuant score",109.2400000,,,,,,
VATQPAPLYPDVGQDEAEKL,nt,V,86,true,"N-terminal ChaFRADIC",92,26010716,"MASCOT Score",78.8900000,,,,,5.7019999388785E-8,
VATQPAPLYPDVGQDEAEK,nt,V,86,true,"Stromal N-terminome",96,26371235,"MASCOT Score",35.7600000,,,,,,
VATQPAPLYPDVGQDE,nt,V,86,true,"N-terminal ChaFRADIC",92,26010716,"MASCOT Score",64.1800000,,,,,3.9940001528294E-8,
VATQPAPLYPDVGQDE,nt,V,86,true,"Arg/N-end rule seed, prt6 vs. Wt",99,29168982,"MASCOT Score",56.2100000,,0.0325374,0.9132038,NO,4.0850001159498E-10,0.2059063
VATQPAPLYPDVGQDE,nt,V,86,true,"HUNTER N-terminome: legumain, GluC and trypsin",119,31951383,"MaxQuant score",93.7660000,,,,,,
VATQPAPLYPDVGQDE,nt,V,86,true,"Arabidopsis translation initiation landscape - NT",167b,35069635,,,,,,,,
VATQPAPLYPDVGQD,nt,V,86,true,"HUNTER N-terminome: legumain, GluC and trypsin",119,31951383,"MaxQuant score",88.1630000,,,,,,
VATQPAPLYPDVGQDEAEKL,nta,V,86,true,"N-terminal ChaFRADIC",92,26010716,"MASCOT Score",78.8900000,,,,,5.7019999388785E-8,
VATQPAPLYPDVGQDEAEK,nta,V,86,true,"Characterization plant N-terminal acetylation",6,22223895,"MASCOT Score",71.3700000,,,,,,
VATQPAPLYPDVGQDEAEK,nta,V,86,true,"Stromal N-terminome",96,26371235,"MASCOT Score",35.7600000,,,,,,
VATQPAPLYPDVGQDEAE,nta,V,86,true,"HUNTER N-terminome: legumain, GluC and trypsin",119,31951383,"MaxQuant score",96.5910000,,,,,,
VATQPAPLYPDVGQDE,nta,V,86,true,"N-terminal ChaFRADIC",92,26010716,"MASCOT Score",23.5000000,,,,,0.00052900001173839,
VATQPAPLYPDVGQDE,nta,V,86,true,"Arg/N-end rule seed, prt6 vs. Wt",99,29168982,"MASCOT Score",37.2600000,,,,,2.5940000341507E-5,0.3114599
VATQPAPLYPDVGQDE,nta,V,86,true,"HUNTER N-terminome: legumain, GluC and trypsin",119,31951383,"MaxQuant score",245.5000000,,,,,,
VATQPAPLYPDVGQDE,nta,V,86,true,"Arabidopsis translation initiation landscape - NTA",167a,35069635,,,,,,,,
ATQPAPLYPDVGQDE,nt,A,87,true,"Arg/N-end rule seed, prt6 vs. Wt",99,29168982,"MASCOT Score",34.6300000,,1.1640708,0.1083459,NO,0.0028599998913705,-1.6843597
TQPAPLYPDVGQDE,nt,T,88,true,"Arg/N-end rule seed, prt6 vs. Wt",99,29168982,"MASCOT Score",23.2500000,,0.3372105,0.2224008,NO,0.037840001285076,-1.3299303
VSEEFISECK,ox,C,118,false,"Redox kickstart of mitochondria",112,31871212,,,,-1.7329929,0.0067734,YES,,
VSEEFISECK,sno,C,118,false,"hot5-4 / wildtype, FAT-switch S-nitrosoproteome",169,37277371,,,,0.0213960,0.9453478,NO,,
VSEEFISECK,so,C,118,false,"Arabidopsis S-sulfenylation chemoproteomics",108,31578252,"pFind PSM Score",0.0853594,,0.8333300,,,,0.6810742
TGCEVMSVSNEDENK,sno,C,132,true,"Site-specific nitrosomeproteomic id - gsnor1-3",90a,25699590,XCorr,3.4824436,,,,,3.316999936942E-7,-5.2813582
TGCEVMSVSNEDENK,sno,C,132,true,"Site-specific nitrosomeproteomic id - gsnor1-3",90b,25699590,XCorr,2.0800000,,,,,0.0015689999563619,-7.1500000
TCYPVASTNTK,ox,C,203,true,"Redox kickstart of mitochondria",112,31871212,,,,-1.4397826,0.0007469,YES,,
GVVFNEMK,mox,M,263,false,"cat2 Methionine oxidation - 1h stress",62a,25693801,"MASCOT Score",50.0000000,,-0.3319693,,NO,,
GVVFNEMK,mox,M,263,false,"cat2 Methionine oxidation - 3h stress",62b,25693801,"MASCOT Score",35.0000000,,0.1053584,,NO,,
VLSEYLDMFEASPSPNSSK,ph,S,349,true,"Tissue atlas Arabidopsis - ProteomicsDB",114,32188942,"MaxQuant score",186.3600000,0.9324660,,,,4.9212400313525E-37,
QKLFSEPVR,nt,Q,358,true,"HUNTER N-terminome: legumain, GluC and trypsin",119,31951383,"MaxQuant score",,,,,,,
ENNTGSFPR,ph,S,500,true,"atm and atr DNA damage response",88,25561503,"MASCOT Score",24.0000000,1.0000000,,,,,-1.3200000
ATEELKLK,ac,K,607,true,"Quantitative Acetylproteomics",101,29440448,,,,,,,,
CVPSLNLGDIPK,sno,C,621,true,"Site-specific nitrosomeproteomic id - gsnor1-3",90a,25699590,XCorr,2.5190301,,,,,0.00045769999269396,-6.5337146
GKDEPCSK,sno,C,726,true,"hot5-4 / wildtype, FAT-switch S-nitrosoproteome",169,37277371,,,,1.1521727,0.0285285,YES,,
GKDEPCSK,so,C,726,true,"S-sulfenylation site detection using YAP1C",110,32714340,,,,,,,,
SGHGIAAARM,nt,S,780,true,"Arabidopsis translation initiation landscape - NT",167b,35069635,,,,,,,,
NGCIVNMTADGK,so,C,843,false,"S-sulfenylation site detection using YAP1C",110,32714340,,,,,,,,
DIYDGTGDFLR,nt,D,967,false,"FtsH12 N-terminome: WT / FtsH12 knockdown miRNA",118,33216923,"MaxQuant score",78.5480000,,,,,0.024995999410748,
