Peptide,PTM,ModifiedAA,ModifiedPosition,PeptideUniqueToGene,ExperimentDesc,ExpID,PubmedID,ScoreType,IdentScore,LocProb,Log2FChange,PQ-val,QuantSig,PEP,MassErrorPPM
GGCTSK,myr,G,2,false,"N-Terminal Myristoylated Proteins",102,29453228,,,,,,,,
DAVLQNDDSTPAHPGKSPVRSSPAVK,ph,S,29,true,"TOR Kinase and ABA Receptor",100,29290610,XCorr,5.7591467,0.8296000,,,,1.2129999959143E-5,
DAVLQNDDSTPAHPGKSPVRSSPAVK,ph,S,29,true,"Tissue atlas Arabidopsis - ProteomicsDB",114,32188942,"MaxQuant score",115.4500000,0.7518490,,,,2.7640700058645E-12,
DAVLQNDDSTPAHPGK,ph,S,29,true,"TOR Kinase and ABA Receptor",100,29290610,XCorr,3.6946740,0.9208000,,,,0.0035610001068562,
DAVLQNDDSTPAHPGKSPVRSSPAVK,ph,T,30,true,"Tissue atlas Arabidopsis - ProteomicsDB",114,32188942,"MaxQuant score",136.2400000,0.8838090,,,,1.0113699656429E-21,
DAVLQNDDSTPAHPGKSPVRSSPAVK,ph,S,37,true,"TOR Kinase and ABA Receptor",100,29290610,XCorr,5.7591467,0.9690000,,,,1.2129999959143E-5,
DAVLQNDDSTPAHPGKSPVR,ph,S,37,true,"STN8 phosphoproteome",38,21768351,"MASCOT Score",94.1700000,,,,,,-0.2488140
DAVLQNDDSTPAHPGKSPVR,ph,S,37,true,"Large-scale phosphorylation discovery",44,23111157,XCorr,2.9880000,,,,,,
DAVLQNDDSTPAHPGKSPVR,ph,S,37,true,"Chloroplast kinase substrates",60,19376835,"MASCOT Score",91.0400000,,,,,,-0.2488140
DAVLQNDDSTPAHPGKSPVR,ph,S,37,true,"atm and atr DNA damage response",88,25561503,"MASCOT Score",46.0000000,1.0000000,,,,,-0.6000000
DAVLQNDDSTPAHPGKSPVR,ph,S,37,true,"TOR Kinase and ABA Receptor",100,29290610,XCorr,3.7485981,1.0000000,,,,0.0048520001582801,
DAVLQNDDSTPAHPGKSPVR,ph,S,37,true,"Tissue atlas Arabidopsis - ProteomicsDB",114,32188942,"MaxQuant score",185.4500000,0.9999810,,,,0,
DAVLQNDDSTPAHPGKSPVRSSPAVK,ph,S,41,true,"Tissue atlas Arabidopsis - ProteomicsDB",114,32188942,"MaxQuant score",154.3500000,0.7551890,,,,0,
ASPFFPFYTPSPAR,ph,T,55,false,"Brassinosteroid-Regulated Phosphorylation Dynamics",94,26187819,"MaxQuant Score",129.1100000,1.0000000,,,,0.00019299999985378,1.1090000
ASPFFPFYTPSPAR,ph,T,55,false,"TOR Kinase and ABA Receptor",100,29290610,XCorr,3.8520634,0.9971000,,,,2.8829999791924E-6,
ASPFFPFYTPSPAR,ph,S,57,false,"Brassinosteroid-Regulated Phosphorylation Dynamics",94,26187819,"MaxQuant Score",129.1100000,1.0000000,,,,0.00019299999985378,-1.2790000
ASPFFPFYTPSPAR,ph,S,57,false,"TOR Kinase and ABA Receptor",100,29290610,XCorr,4.4080172,0.9998000,,,,5.1719998737099E-6,
DGGGGESKSVTSTPLR,ph,S,74,true,"Tissue atlas Arabidopsis - ProteomicsDB",114,32188942,"MaxQuant score",62.7920000,0.9180160,,,,0.0010168299777433,
DGGGGESKSVTSTPLR,ph,S,76,true,"atm and atr DNA damage response",88,25561503,"MASCOT Score",22.0000000,1.0000000,,,,,-0.6400000
DGGGGESKSVTSTPLR,ph,S,76,true,"Tissue atlas Arabidopsis - ProteomicsDB",114,32188942,"MaxQuant score",172.9300000,0.9955190,,,,2.6568599560756E-17,
SVTSTPLR,ph,S,76,true,"atm and atr DNA damage response",88,25561503,"MASCOT Score",34.0000000,1.0000000,,,,,-0.3200000
SVTSTPLR,ph,T,78,true,"atm and atr DNA damage response",88,25561503,"MASCOT Score",28.0000000,0.9720000,,,,,-0.3200000
DGGGGESKSVTSTPLR,ph,T,80,true,"atm and atr DNA damage response",88,25561503,"MASCOT Score",22.0000000,0.9890000,,,,,-0.6400000
DGGGGESKSVTSTPLR,ph,T,80,true,"Tissue atlas Arabidopsis - ProteomicsDB",114,32188942,"MaxQuant score",172.9300000,0.9970860,,,,2.6568599560756E-17,
SVTSTPLR,ph,T,80,true,"atm and atr DNA damage response",88,25561503,"MASCOT Score",30.0000000,0.9930000,,,,,-0.0100000
AFHPPSPAR,ph,S,93,true,"atm and atr DNA damage response",88,25561503,"MASCOT Score",34.0000000,1.0000000,,,,,-0.1000000
AFHPPSPAR,ph,S,93,true,"TOR Kinase and ABA Receptor",100,29290610,XCorr,2.9644990,1.0000000,,,,0.020670000463724,
AFHPPSPAR,ph,S,93,true,"Col-0 callus - FC Col-0 vs. Col-0 Xray",111a,31410901,,24.9300000,,-1.5543185,0.0000000,NO,,-0.0745753
AFHPPSPAR,ph,S,93,true,"Col-0 X-ray callus - FC Col-0 vs. Col-0 Xray",111b,31410901,,24.9300000,,-1.5543185,0.0000000,NO,,-0.0745753
AFHPPSPAR,ph,S,93,true,"atm callus - FC atm vs. atm Xray",111c,31410901,,24.9300000,,-1.1209535,0.0000000,NO,,-0.0745753
AFHPPSPAR,ph,S,93,true,"atm-3 X-ray callus - FC atm vs. atm Xray",111d,31410901,,24.9300000,,-1.1209535,0.0000000,NO,,-0.0745753
AFHPPSPAR,ph,S,93,true,"Tissue atlas Arabidopsis - ProteomicsDB",114,32188942,"MaxQuant score",125.6600000,1.0000000,,,,0.00019793299725279,
LNDIVGSAYYVAPEVLHR,ph,S,312,false,"Tissue atlas Arabidopsis - ProteomicsDB",114,32188942,"MaxQuant score",54.9850000,0.9838700,,,,0.00049012998351827,
DIVGSAYYVAPEVLHR,ph,S,312,false,"Tissue atlas Arabidopsis - ProteomicsDB",114,32188942,"MaxQuant score",153.2400000,1.0000000,,,,7.4156701612704E-11,
TESGIFR,ph,S,354,false,"Arabidopsis root NAA phosphoproteome",18a,27643528,"MaxQuant Score",53.9680000,0.9990000,,,,0.0080000003799796,-0.8510000
TESGIFR,ph,S,354,false,"Phosphorylation Early Elicitor Signaling",23,17317660,,,,,,,,
TESGIFR,ph,S,354,false,"Plasmembrane Ph Immune Responses",25,17651370,,,,,,,,
TESGIFR,ph,S,354,false,"srk2dei ABA signaling phopshoproteomics",83,23572148,"MASCOT Score",47.0000000,,,,,,-0.0001000
TESGIFR,ph,S,354,false,"Phospho cell culture sucrose/TOR",109,30833711,,,0.9999660,,,,,
TESGIFR,ph,S,354,false,"Tissue atlas Arabidopsis - ProteomicsDB",114,32188942,"MaxQuant score",194.2900000,1.0000000,,,,6.5661898140945E-9,
