Peptide,PTM,ModifiedAA,ModifiedPosition,PeptideUniqueToGene,ExperimentDesc,ExpID,PubmedID,ScoreType,IdentScore,LocProb,Log2FChange,PQ-val,QuantSig,PEP,MassErrorPPM
MEDLDPTYIQAPEHRSDSN,nta,M,1,true,"HUNTER N-terminome: legumain, GluC and trypsin",119,31951383,"MaxQuant score",81.4310000,,,,,,
MEDLDPTYIQAPEHRSD,nta,M,1,true,"HUNTER N-terminome: legumain, GluC and trypsin",119,31951383,"MaxQuant score",74.3260000,,,,,,
MEDLDPTYIQAPEHR,nta,M,1,true,"Arg/N-end rule pathway Roots",80,25728785,"MASCOT Score",99.9000000,,,,,2.5610000786713E-9,
MEDLDPTYIQAPEHR,nta,M,1,true,"Stromal N-terminome",96,26371235,"MASCOT Score",33.1800000,,,,,,
MEDLDPTYIQAPEHR,nta,M,1,true,"Arg/N-end rule seed, prt6 vs. Wt",99,29168982,"MASCOT Score",86.9700000,,,,,0.00012419999984559,-1.2383176
MEDLDPTYIQAPEHR,nta,M,1,true,"FtsH12 N-terminome: WT / FtsH12 knockdown miRNA",118,33216923,"MaxQuant score",120.1200000,,,,,0.00019911999697797,
MEDLDPTYIQAPEHR,nta,M,1,true,"HUNTER N-terminome: legumain, GluC and trypsin",119,31951383,"MaxQuant score",77.5930000,,,,,,
MEDLDPTYIQAPEHR,nta,M,1,true,"Arabidopsis translation initiation landscape - NTA",167a,35069635,,,,,,,,
MEDLDPTYIQ,nta,M,1,true,"N-term acetylation drought responses",5,26184543,,,,,,,,
MEDLDPTYIQAPEHR,ph,T,7,true,"Tissue atlas Arabidopsis - ProteomicsDB",114,32188942,"MaxQuant score",155.2800000,1.0000000,,,,1.6238600091326E-12,
