Peptide,PTM,ModifiedAA,ModifiedPosition,PeptideUniqueToGene,ExperimentDesc,ExpID,PubmedID,ScoreType,IdentScore,LocProb,Log2FChange,PQ-val,QuantSig,PEP,MassErrorPPM
ASGPIRASSVVTEASPTN,nt,A,58,true,"HUNTER N-terminome: legumain, GluC and trypsin",119,31951383,"MaxQuant score",127.0200000,,,,,,
ASSVVTEASPTNLNSKEEDLVFVAGATGKVGSR,nt,A,64,true,"HUNTER N-terminome: legumain, GluC and trypsin",119,31951383,"MaxQuant score",176.4400000,,,,,,
ASSVVTEASPTNLNSKEEDLVFVAGATGKVGSR,nta,A,64,true,"HUNTER N-terminome: legumain, GluC and trypsin",119,31951383,"MaxQuant score",199.2900000,,,,,,
ASSVVTEASPTNLNSK,nta,A,64,true,"Characterization plant N-terminal acetylation",6,22223895,"MASCOT Score",87.1400000,,,,,,
ASSVVTEASPTN,nta,A,64,true,"HUNTER N-terminome: legumain, GluC and trypsin",119,31951383,"MaxQuant score",114.9700000,,,,,,
SSVVTEASPTNLNSKEEDLVFVAGATGKVGSR,nt,S,65,true,"HUNTER N-terminome: legumain, GluC and trypsin",119,31951383,"MaxQuant score",100.3600000,,,,,,
SSVVTEASPTNLNSKEEDLVFVAGATGKVGSR,nta,S,65,true,"HUNTER N-terminome: legumain, GluC and trypsin",119,31951383,"MaxQuant score",57.2620000,,,,,,
SSVVTEASPTN,nta,S,65,true,"HUNTER N-terminome: legumain, GluC and trypsin",119,31951383,"MaxQuant score",164.4600000,,,,,,
ELLKLGFR,ac,K,103,true,"Histone deacetylases - apicidin vs control",98a,29061669,"MaxQuant Score",117.9000000,1.0000000,0.0340000,0.8550667,NO,0.0040000001899898,
ELLKLGFR,ac,K,103,true,"Histone deacetylases - hda14 vs WT (thylakoids)",98d,29061669,"MaxQuant Score",90.6000000,1.0000000,0.3040000,0.8550667,NO,0.017000000923872,
ELLKLGFR,ac,K,103,true,"Quantitative Acetylproteomics",101,29440448,,,,,,,,
AGSLVQSVK,ph,S,120,true,"atm and atr DNA damage response",88,25561503,"MASCOT Score",58.0000000,1.0000000,,,,,-2.1800000
AGSLVQSVK,ph,S,120,true,"Tissue atlas Arabidopsis - ProteomicsDB",114,32188942,"MaxQuant score",97.4390000,0.9999950,,,,0.0013971900334582,
LEIVECDLEKK,ac,K,152,true,"Histone deacetylases - hda14 vs WT (thylakoids)",98d,29061669,"MaxQuant Score",56.2000000,1.0000000,-0.5980000,0.7030723,NO,0.018999999389052,
IDYLATKNLVDAATSAK,ac,K,192,true,"Quantitative Acetylproteomics",101,29440448,,,,,,,,
IVEVVAETTAPLTPIEK,ph,T,317,true,"Tissue atlas Arabidopsis - ProteomicsDB",114,32188942,"MaxQuant score",133.1600000,0.9999070,,,,1.6283600023925E-9,
EVKPVPTKPVTQEPTAPK,ac,K,346,true,"Histone deacetylases - hda14 vs WT (thylakoids)",98d,29061669,"MaxQuant Score",56.4000000,0.9990000,-3.3310000,0.0895365,NO,3.8499998481711E-5,
STSNVPVVE,nt,S,425,true,"N-terminal ChaFRADIC",92,26010716,"MASCOT Score",26.1300000,,,,,0.04602999985218,
KSDSLSPGPTDSDTDKSSTVAK,ph,S,470,true,"Tissue atlas Arabidopsis - ProteomicsDB",114,32188942,"MaxQuant score",60.5410000,0.8991180,,,,3.2605301385047E-5,
KSDSLSPGPTDSDTDKSSTVAK,ph,S,474,true,"Tissue atlas Arabidopsis - ProteomicsDB",114,32188942,"MaxQuant score",95.1080000,0.9837390,,,,2.9243000382317E-11,
KSDSLSPGPTDSDTDKSSTVAK,ph,S,480,true,"Tissue atlas Arabidopsis - ProteomicsDB",114,32188942,"MaxQuant score",76.8350000,0.8790980,,,,8.2462497630331E-7,
TAVATSVTE,nt,T,495,true,"N-terminal ChaFRADIC",92,26010716,"MASCOT Score",42.4300000,,,,,0.001189999980852,
TAVATSVTE,nt,T,513,true,"N-terminal ChaFRADIC",92,26010716,"MASCOT Score",42.4300000,,,,,0.001189999980852,
