Peptide,PTM,ModifiedAA,ModifiedPosition,PeptideUniqueToGene,ExperimentDesc,ExpID,PubmedID,ScoreType,IdentScore,LocProb,Log2FChange,PQ-val,QuantSig,PEP,MassErrorPPM
TAPSPPPVK,ph,S,13,true,"atm and atr DNA damage response",88,25561503,"MASCOT Score",30.0000000,1.0000000,,,,,-0.8600000
TAPSPPPVK,ph,S,13,true,"Tissue atlas Arabidopsis - ProteomicsDB",114,32188942,"MaxQuant score",91.6580000,0.9999960,,,,0.0021293899044394,
HVPESVLPAKPPKR,ub,K,28,true,"upl3 mutant / wildtype",168,35926874,"MaxQuant score",63.0910000,0.9020000,0.8131142,0.2853200,NO,0.00045068998588249,-0.6222600
VLDKTSDSPTEATLR,ac,K,237,true,"Quantitative Acetylproteomics",101,29440448,,,,,,,,
GNPEKTVPNPEVEIGSNK,ub,K,516,true,"upl3 mutant / wildtype",168,35926874,"MaxQuant score",103.7500000,1.0000000,-0.3978282,0.7022400,NO,2.2952299782997E-10,-1.1537000
TVPNPEVEIGSNKQWK,ph,S,527,true,"Tissue atlas Arabidopsis - ProteomicsDB",114,32188942,"MaxQuant score",133.7100000,1.0000000,,,,4.1609300893697E-8,
TVPNPEVEIGSNK,ph,S,527,true,"atm and atr DNA damage response",88,25561503,"MASCOT Score",58.0000000,1.0000000,,,,,-0.0500000
TVPNPEVEIGSNK,ph,S,527,true,"TOR Kinase and ABA Receptor",100,29290610,XCorr,2.5462694,1.0000000,,,,0.094020001590252,
TVPNPEVEIGSNKQWK,ub,K,529,true,"upl3 mutant / wildtype",168,35926874,"MaxQuant score",78.6900000,1.0000000,0.5370475,,,2.8423999538063E-5,-0.6232600
