Peptide,PTM,ModifiedAA,ModifiedPosition,PeptideUniqueToGene,ExperimentDesc,ExpID,PubmedID,ScoreType,IdentScore,LocProb,Log2FChange,PQ-val,QuantSig,PEP,MassErrorPPM
HQMPYYAGNGYATGK,ph,T,229,true,"Tissue atlas Arabidopsis - ProteomicsDB",114,32188942,"MaxQuant score",168.4200000,1.0000000,,,,2.812450147755E-17,
LSQDNVTHVSTR,ph,T,491,true,"Tissue atlas Arabidopsis - ProteomicsDB",114,32188942,"MaxQuant score",94.0110000,0.9998370,,,,0.00060876802308485,
LSQDNVTHVSTR,ph,S,494,true,"Tissue atlas Arabidopsis - ProteomicsDB",114,32188942,"MaxQuant score",211.1700000,0.9993440,,,,2.1731900089076E-31,
LSQDNVTHVSTR,ph,T,495,true,"Tissue atlas Arabidopsis - ProteomicsDB",114,32188942,"MaxQuant score",166.0400000,0.9999190,,,,4.3125300151683E-14,
IMGTFGYLAPEYASSGK,ph,T,500,false,"Tissue atlas Arabidopsis - ProteomicsDB",114,32188942,"MaxQuant score",167.0500000,1.0000000,,,,4.6190701435757E-22,
ALEGDATLDDLSEGGK,ph,S,619,true,"Pollen phosphoproteome Arabidopsis",43,22631563,"MASCOT Score",36.2000000,,,,,,-2.9516700
ALEGDATLDDLSEGGK,ph,S,619,true,"Tissue atlas Arabidopsis - ProteomicsDB",114,32188942,"MaxQuant score",232.1500000,1.0000000,,,,0,
AGQSSFLGR,ph,S,627,true,"Tissue atlas Arabidopsis - ProteomicsDB",114,32188942,"MaxQuant score",131.1200000,0.9804060,,,,0.0001160429965239,
AGQSSFLGR,ph,S,628,true,"Tissue atlas Arabidopsis - ProteomicsDB",114,32188942,"MaxQuant score",133.1200000,0.9865970,,,,0.00010951099829981,
GSSSDYDSSTYSADMKK,ph,S,635,true,"Tissue atlas Arabidopsis - ProteomicsDB",114,32188942,"MaxQuant score",192.7800000,0.9749980,,,,3.2985094486819E-39,
GSSSDYDSSTYSADMK,ph,S,640,true,"Tissue atlas Arabidopsis - ProteomicsDB",114,32188942,"MaxQuant score",88.4270000,0.7614780,,,,0.00015686599363107,
GSSSDYDSSTYSADMKK,ph,S,644,true,"Tissue atlas Arabidopsis - ProteomicsDB",114,32188942,"MaxQuant score",113.2800000,0.9730260,,,,4.2830499147328E-9,
