Peptide,PTM,ModifiedAA,ModifiedPosition,PeptideUniqueToGene,ExperimentDesc,ExpID,PubmedID,ScoreType,IdentScore,LocProb,Log2FChange,PQ-val,QuantSig,PEP,MassErrorPPM
ASSTPKTLMDFFQPAKR,nta,A,2,true,"Arabidopsis translation initiation landscape - NTA",167a,35069635,,,,,,,,
LKASPSSSSFPAVSVAGGSR,ph,S,22,true,"Tissue atlas Arabidopsis - ProteomicsDB",114,32188942,"MaxQuant score",200.8700000,0.9998430,,,,0,
ASPSSSSFPAVSVAGGSR,ph,S,24,true,"TOR Kinase and ABA Receptor",100,29290610,XCorr,4.5269461,0.8390000,,,,7.3739997787925E-6,
ASPSSSSFPAVSVAGGSR,ph,S,24,true,"Col-0 callus - FC Col-0 vs. Col-0 Xray",111a,31410901,,62.8000000,,-0.0151499,0.0000000,NO,,1.0159689
ASPSSSSFPAVSVAGGSR,ph,S,24,true,"Col-0 X-ray callus - FC Col-0 vs. Col-0 Xray",111b,31410901,,62.8000000,,-0.0151499,0.0000000,NO,,1.0159689
ASPSSSSFPAVSVAGGSR,ph,S,24,true,"atm callus - FC atm vs. atm Xray",111c,31410901,,62.8000000,,0.0318261,0.0000000,NO,,1.0159689
ASPSSSSFPAVSVAGGSR,ph,S,24,true,"atm-3 X-ray callus - FC atm vs. atm Xray",111d,31410901,,62.8000000,,0.0318261,0.0000000,NO,,1.0159689
ASPSSSSFPAVSVAGGSR,ph,S,24,true,"Tissue atlas Arabidopsis - ProteomicsDB",114,32188942,"MaxQuant score",191.4000000,0.9521810,,,,4.2038953929745E-45,
DLGSVANSPPR,ph,S,46,false,"Large-scale phosphorylation discovery",44,23111157,XCorr,2.6850000,,,,,,
DLGSVANSPPR,ph,S,46,false,"Tyrosine phosphorylation in Arabidopsis",59,18463617,"MASCOT Score",43.0000000,,,,,,-1.5106670
DLGSVANSPPR,ph,S,46,false,"atm and atr DNA damage response",88,25561503,"MASCOT Score",55.0000000,1.0000000,,,,,-1.5000000
DLGSVANSPPR,ph,S,46,false,"Phospho cell culture sucrose/TOR",109,30833711,,,1.0000000,,,,,
DLGSVANSPPR,ph,S,46,false,"Col-0 callus - FC Col-0 vs. Col-0 Xray",111a,31410901,,64.3900000,,-0.7514229,0.0000000,NO,,0.0592148
DLGSVANSPPR,ph,S,46,false,"Col-0 X-ray callus - FC Col-0 vs. Col-0 Xray",111b,31410901,,64.3900000,,-0.7514229,0.0000000,NO,,0.0592148
DLGSVANSPPR,ph,S,46,false,"atm callus - FC atm vs. atm Xray",111c,31410901,,64.3900000,,-0.6988963,0.0000000,NO,,0.0592148
DLGSVANSPPR,ph,S,46,false,"atm-3 X-ray callus - FC atm vs. atm Xray",111d,31410901,,64.3900000,,-0.6988963,0.0000000,NO,,0.0592148
DLGSVANSPPR,ph,S,46,false,"Tissue atlas Arabidopsis - ProteomicsDB",114,32188942,"MaxQuant score",212.6800000,1.0000000,,,,0,
VTVTTSVADDSSGLTPEQIAR,ph,T,64,true,"Tissue atlas Arabidopsis - ProteomicsDB",114,32188942,"MaxQuant score",178.8200000,0.8838450,,,,1.2331426486058E-43,
