Peptide,PTM,ModifiedAA,ModifiedPosition,PeptideUniqueToGene,ExperimentDesc,ExpID,PubmedID,ScoreType,IdentScore,LocProb,Log2FChange,PQ-val,QuantSig,PEP,MassErrorPPM
SVTEVETPASMTKPLKK,ph,T,10,true,"Tissue atlas Arabidopsis - ProteomicsDB",114,32188942,"MaxQuant score",88.9510000,0.9854310,,,,6.2289000197779E-5,
SVTEVETPASMTKPLKK,ph,S,17,true,"Tissue atlas Arabidopsis - ProteomicsDB",114,32188942,"MaxQuant score",194.9200000,0.9579120,,,,1.0932398125246E-39,
SVTEVETPASMTKPLKK,ph,T,19,true,"Tissue atlas Arabidopsis - ProteomicsDB",114,32188942,"MaxQuant score",145.5200000,0.8679790,,,,1.8581399439943E-12,
KVESSSSDASDSDEEEK,ph,S,70,true,"Tissue atlas Arabidopsis - ProteomicsDB",114,32188942,"MaxQuant score",136.9900000,1.0000000,,,,1.6973699721458E-21,
KVESSSSDASDSDEEEK,ph,S,72,true,"Tissue atlas Arabidopsis - ProteomicsDB",114,32188942,"MaxQuant score",136.9900000,1.0000000,,,,1.6973699721458E-21,
LKDESSSEEEDDSSSDEEIAPAK,ph,S,97,true,"Phospho cell culture sucrose/TOR",109,30833711,,,0.8050180,,,,,
AKVESSSSDDDSTSDEETAPVK,ph,S,123,true,"Tissue atlas Arabidopsis - ProteomicsDB",114,32188942,"MaxQuant score",140.6700000,0.9529690,,,,5.6534999442007E-29,
AKVESSSSDDDSTSDEETAPVKK,ph,S,129,true,"Tissue atlas Arabidopsis - ProteomicsDB",114,32188942,"MaxQuant score",140.6700000,0.8396830,,,,5.6534999442007E-29,
KDSSDESSSDEETPVVK,ph,S,243,true,"Tissue atlas Arabidopsis - ProteomicsDB",114,32188942,"MaxQuant score",172.2600000,0.8272650,,,,2.4205700962139E-19,
KKDSDVEMVDAEQK,ph,S,356,true,"Tyrosine phosphorylation in Arabidopsis",59,18463617,"MASCOT Score",65.0000000,,,,,,-0.8231753
KKDSDVEMVDAEQK,ph,S,356,true,"TOR Kinase and ABA Receptor",100,29290610,XCorr,4.6029000,1.0000000,,,,5.0590001592354E-6,
KKDSDVEMVDAEQK,ph,S,356,true,"Phospho cell culture sucrose/TOR",109,30833711,,,1.0000000,,,,,
KKDSDVEMVDAEQK,ph,S,356,true,"Tissue atlas Arabidopsis - ProteomicsDB",114,32188942,"MaxQuant score",211.1300000,1.0000000,,,,6.6253391393277E-42,
DSDVEMVDAEQKSNAK,ph,S,367,true,"Tissue atlas Arabidopsis - ProteomicsDB",114,32188942,"MaxQuant score",269.3400000,1.0000000,,,,0,
SDIENFFK,ph,S,398,true,"Tissue atlas Arabidopsis - ProteomicsDB",114,32188942,"MaxQuant score",83.3090000,1.0000000,,,,0.008071600459516,
LSSFDDGSFK,ph,S,417,true,"Tissue atlas Arabidopsis - ProteomicsDB",114,32188942,"MaxQuant score",91.9610000,0.9995680,,,,0.0010170900495723,
LSSFDDGSFK,ph,S,422,true,"Tissue atlas Arabidopsis - ProteomicsDB",114,32188942,"MaxQuant score",134.1800000,0.9999940,,,,1.954909930646E-5,
GYGHIEFASPEEAQK,ph,S,433,true,"Tissue atlas Arabidopsis - ProteomicsDB",114,32188942,"MaxQuant score",175.4800000,1.0000000,,,,3.075089911559E-29,
LDLANERGTPRNSNPGR,ph,T,463,true,"Tissue atlas Arabidopsis - ProteomicsDB",114,32188942,"MaxQuant score",126.5600000,1.0000000,,,,5.9199599490967E-5,
LDLANERGTPRNSNPGR,ph,S,467,true,"Tissue atlas Arabidopsis - ProteomicsDB",114,32188942,"MaxQuant score",58.5160000,1.0000000,,,,0.0055980999022722,
SSSLGEDEIKKELRSHF,nt,S,487,true,"Arabidopsis translation initiation landscape - NT",167b,35069635,,,,,,,,
GFSSSLGEDEIKK,ph,S,487,true,"Tissue atlas Arabidopsis - ProteomicsDB",114,32188942,"MaxQuant score",240.9200000,0.9980880,,,,0,
GFSSSLGEDEIKK,ph,S,488,true,"Tissue atlas Arabidopsis - ProteomicsDB",114,32188942,"MaxQuant score",141.5800000,0.9651680,,,,4.4669000089925E-6,
GFSSSLGEDEIKK,ph,S,489,true,"Tissue atlas Arabidopsis - ProteomicsDB",114,32188942,"MaxQuant score",144.5100000,0.9834210,,,,8.9219798216078E-11,
SHFSKCGEVTR,nt,S,501,true,"Arabidopsis translation initiation landscape - NT",167b,35069635,,,,,,,,
SKCGEVTRVHVPTDRETGASRGFAYI,nt,S,504,true,"Arabidopsis translation initiation landscape - NT",167b,35069635,,,,,,,,
CGEVTR,so,C,506,false,"S-sulfenylation site detection using YAP1C",110,32714340,,,,,,,,
