Peptide,PTM,ModifiedAA,ModifiedPosition,PeptideUniqueToGene,ExperimentDesc,ExpID,PubmedID,ScoreType,IdentScore,LocProb,Log2FChange,PQ-val,QuantSig,PEP,MassErrorPPM
VESDKSSVEELKKR,nt,V,2,true,"Arg/N-end rule pathway Roots",80,25728785,"MASCOT Score",30.1600000,,,,,0.060490000993013,
VESDKSSVEELK,ph,S,4,true,"atm and atr DNA damage response",88,25561503,"MASCOT Score",32.0000000,1.0000000,,,,,-2.6500000
VESDKSSVEELK,ph,S,4,true,"Tissue atlas Arabidopsis - ProteomicsDB",114,32188942,"MaxQuant score",119.7700000,0.9999780,,,,4.2380699596833E-5,
VESDKSSVEELK,ph,S,8,true,"Tissue atlas Arabidopsis - ProteomicsDB",114,32188942,"MaxQuant score",186.7000000,0.9566510,,,,6.5613601161886E-20,
THTVEENADETQKKSEK,ph,T,44,true,"Tissue atlas Arabidopsis - ProteomicsDB",114,32188942,"MaxQuant score",117.3700000,0.8946930,,,,1.4957900473789E-9,
THTVEENADETQKKSEK,ph,S,48,true,"Tissue atlas Arabidopsis - ProteomicsDB",114,32188942,"MaxQuant score",141.9300000,0.9070260,,,,1.0556699611697E-11,
IASGSNLVIATPGR,ph,T,218,true,"Tissue atlas Arabidopsis - ProteomicsDB",114,32188942,"MaxQuant score",94.3250000,1.0000000,,,,0.00047840201295912,
VTNEGLEQGYCVVPSK,sno,C,314,true,"hot5-4 / wildtype, FAT-switch S-nitrosoproteome",169,37277371,,,,0.3435387,0.0299909,NO,,
VNLNIESGAGK,ph,S,536,true,"Tissue atlas Arabidopsis - ProteomicsDB",114,32188942,"MaxQuant score",130.1500000,1.0000000,,,,4.5787401177222E-6,
NGFSPYSPYGK,ph,S,557,true,"Tissue atlas Arabidopsis - ProteomicsDB",114,32188942,"MaxQuant score",147.0200000,0.9997740,,,,3.1528500699096E-8,
