Peptide,PTM,ModifiedAA,ModifiedPosition,PeptideUniqueToGene,ExperimentDesc,ExpID,PubmedID,ScoreType,IdentScore,LocProb,Log2FChange,PQ-val,QuantSig,PEP,MassErrorPPM
MEVSQDGSER,nta,M,1,true,"N-term acetylation drought responses",5,26184543,,,,,,,,
MEVSQDGSER,nta,M,1,true,"Characterization plant N-terminal acetylation",6,22223895,"MASCOT Score",58.2100000,,,,,,
MEVSQDGSER,nta,M,1,true,"Arg/N-end rule pathway Roots",80,25728785,"MASCOT Score",59.1500000,,,,,2.1509999896807E-6,
MEVSQDGSER,nta,M,1,true,"FtsH12 N-terminome: WT / FtsH12 knockdown miRNA",118,33216923,"MaxQuant score",72.1520000,,,,,0.010619999840856,
GYQEEVDNITKR,ac,K,101,true,"Quantitative Acetylproteomics",101,29440448,,,,,,,,
KLSEVESENR,ub,K,136,true,"Arabidopsis ubiquitination COFRADIC",40,26744219,"MaxQuant Score",62.1660000,1.0000000,,,,0.00040459999581799,-3.7840000
TEATHLKNQQATIR,ac,K,162,true,"Quantitative Acetylproteomics",101,29440448,,,,,,,,
AQSDEETAGK,ph,S,247,true,"atm and atr DNA damage response",88,25561503,"MASCOT Score",50.0000000,1.0000000,,,,,0.0200000
SDNIDSNSMLENSLTAK,ph,S,303,true,"Tissue atlas Arabidopsis - ProteomicsDB",114,32188942,"MaxQuant score",70.7830000,0.9535140,,,,0.00051068997709081,
YVQDYNHDKVVSR,ph,S,573,true,"Tissue atlas Arabidopsis - ProteomicsDB",114,32188942,"MaxQuant score",73.2100000,0.9997360,,,,0.00015077600255609,
YVEDLESGFSSDVESK,ph,S,585,true,"Tissue atlas Arabidopsis - ProteomicsDB",114,32188942,"MaxQuant score",210.1000000,0.9999340,,,,0,
KYVEDLESGFSSDVESK,ph,S,588,true,"Brassinosteroid-Regulated Phosphorylation Dynamics",94,26187819,"MaxQuant Score",114.3700000,0.8210000,,,,1.4869999631628E-6,3.6930000
YVEDLESGFSSDVESK,ph,S,588,true,"BSK8 and BSL2 regulating sucrose-ph synthase",66,24924143,"MaxQuant Score",159.9500000,,,,,,-0.0616350
YVEDLESGFSSDVESK,ph,S,588,true,"TOR Kinase and ABA Receptor",100,29290610,XCorr,6.4571137,0.9282000,,,,5.0390001199441E-11,
YVEDLESGFSSDVESK,ph,S,588,true,"Lateral root-induction - NAA vs control",106,23328941,"MASCOT Score",46.0000000,,,,,,
YVEDLESGFSSDVESK,ph,S,588,true,"Tissue atlas Arabidopsis - ProteomicsDB",114,32188942,"MaxQuant score",271.3100000,0.7842450,,,,0,
KYVEDLESGFSSDVESK,ph,S,589,true,"Arabidopsis root NAA phosphoproteome",18a,27643528,"MaxQuant Score",153.5600000,0.8320000,,,,5.3120000899204E-20,-1.1650000
KYVEDLESGFSSDVESK,ph,S,589,true,"STN8 phosphoproteome",38,21768351,"MASCOT Score",49.5900000,,,,,,-0.4647540
KYVEDLESGFSSDVESK,ph,S,589,true,"Tyrosine phosphorylation in Arabidopsis",59,18463617,"MASCOT Score",70.0000000,,,,,,-1.2513464
KYVEDLESGFSSDVESK,ph,S,589,true,"srk2dei ABA signaling phopshoproteomics",83,23572148,"MASCOT Score",27.0000000,,,,,,0.0001000
KYVEDLESGFSSDVESK,ph,S,589,true,"LAXIC - ABA stress",84a,23660473,XCorr,5.8700000,0.9950000,,,,4.6499998518357E-8,
KYVEDLESGFSSDVESK,ph,S,589,true,"TOR Kinase and ABA Receptor",100,29290610,XCorr,6.6403551,0.9202000,,,,2.5349999432933E-8,
KYVEDLESGFSSDVESK,ph,S,589,true,"Phospho cell culture sucrose/TOR",109,30833711,,,0.9801370,,,,,
KYVEDLESGFSSDVESK,ph,S,589,true,"Col-0 callus - FC Col-0 vs. Col-0 Xray",111a,31410901,,77.7500000,,-0.1864270,0.0000000,NO,,-1.7923184
KYVEDLESGFSSDVESK,ph,S,589,true,"Col-0 X-ray callus - FC Col-0 vs. Col-0 Xray",111b,31410901,,77.7500000,,-0.1864270,0.0000000,NO,,-1.7923184
KYVEDLESGFSSDVESK,ph,S,589,true,"atm callus - FC atm vs. atm Xray",111c,31410901,,77.7500000,,-0.0541928,0.0000000,NO,,-1.7923184
KYVEDLESGFSSDVESK,ph,S,589,true,"atm-3 X-ray callus - FC atm vs. atm Xray",111d,31410901,,77.7500000,,-0.0541928,0.0000000,NO,,-1.7923184
KYVEDLESGFSSDVESK,ph,S,589,true,"Tissue atlas Arabidopsis - ProteomicsDB",114,32188942,"MaxQuant score",419.4300000,0.9899770,,,,0,
YVEDLESGFSSDVESK,ph,S,589,true,"Phosphorylation nuclei-enriched fractions",28,19245862,,,,,,,,
YVEDLESGFSSDVESK,ph,S,589,true,"Phosphoproteomic analysis of seed maturation",42,22440515,"MASCOT Score",95.0000000,,,,,,-1.8700000
YVEDLESGFSSDVESK,ph,S,589,true,"Large-scale phosphorylation discovery",44,23111157,XCorr,6.0080000,,,,,,
YVEDLESGFSSDVESK,ph,S,589,true,"Tyrosine phosphorylation in Arabidopsis",59,18463617,"MASCOT Score",81.0000000,,,,,,-1.7649395
YVEDLESGFSSDVESK,ph,S,589,true,"Conserved plant phosphoproteome - Arabidopsis",61a,20466843,"MASCOT Score",23.0000000,1.0000000,,,,,
YVEDLESGFSSDVESK,ph,S,589,true,"BSK8 and BSL2 regulating sucrose-ph synthase",66,24924143,"MaxQuant Score",169.4300000,,,,,,0.1624000
YVEDLESGFSSDVESK,ph,S,589,true,"LAXIC - ABA stress",84a,23660473,XCorr,5.4100000,1.0000000,,,,7.3000000141987E-12,
YVEDLESGFSSDVESK,ph,S,589,true,"LAXIC - mannitol vs control",84b,23660473,XCorr,5.5600000,1.0000000,-1.0887710,,NO,9.5399998826906E-5,
YVEDLESGFSSDVESK,ph,S,589,true,"SnRK2 protein kinase substrates",85,23776212,XCorr,3.7294970,0.9990000,,,,1.0509899617261E-9,
YVEDLESGFSSDVESK,ph,S,589,true,"SIRK1 phosphorylation",86a,23820729,"MaxQuant Score",159.4400000,0.9860000,,,,0.00070600002072752,7.8300000
YVEDLESGFSSDVESK,ph,S,589,true,"SIRK1 exp - sirk1 mutant vs WT",86b,23820729,,,,-0.1661152,,NO,,
YVEDLESGFSSDVESK,ph,S,589,true,"SIRK1 exp - 35S:SIRK1 vs WT",86c,23820729,,,,-1.1247586,,NO,,
YVEDLESGFSSDVESK,ph,S,589,true,"Lateral root-induction - NAA vs control",106,23328941,"MASCOT Score",56.0000000,,,,,,
YVEDLESGFSSDVESK,ph,S,589,true,"Col-0 callus - FC Col-0 vs. Col-0 Xray",111a,31410901,,87.5400000,,-0.0923675,0.0000000,NO,,1.0934345
YVEDLESGFSSDVESK,ph,S,589,true,"Col-0 X-ray callus - FC Col-0 vs. Col-0 Xray",111b,31410901,,87.5400000,,-0.0923675,0.0000000,NO,,1.0934345
YVEDLESGFSSDVESK,ph,S,589,true,"atm callus - FC atm vs. atm Xray",111c,31410901,,87.5400000,,-0.1329023,0.0000000,NO,,1.0934345
YVEDLESGFSSDVESK,ph,S,589,true,"atm-3 X-ray callus - FC atm vs. atm Xray",111d,31410901,,87.5400000,,-0.1329023,0.0000000,NO,,1.0934345
YVEDLESGFSSDVESK,ph,S,589,true,"Touch-induced phosphorylation: 40s touch vs untouc",136,30291188,"MASCOT score",103.0600000,,-0.0564717,0.7525857,NO,,4.0661994
YVEDLESGFSSDVESK,ph,S,593,true,"srk2dei ABA signaling phopshoproteomics",83,23572148,"MASCOT Score",33.0000000,,,,,,-0.0002000
IYEDDINPFAAFSKK,ph,S,610,true,"Tissue atlas Arabidopsis - ProteomicsDB",114,32188942,"MaxQuant score",107.4500000,1.0000000,,,,1.2741900263791E-6,
