Peptide,PTM,ModifiedAA,ModifiedPosition,PeptideUniqueToGene,ExperimentDesc,ExpID,PubmedID,ScoreType,IdentScore,LocProb,Log2FChange,PQ-val,QuantSig,PEP,MassErrorPPM
LRNLGLGSDDEDDVEDDEGGGINGGDVKPVTGEER,ph,S,148,true,"STN8 phosphoproteome",38,21768351,"MASCOT Score",173.8200000,,,,,,-0.1317600
LRNLGLGSDDEDDVEDDEGGGINGGDVKPVTGEER,ph,S,148,true,"Chloroplast kinase substrates",60,19376835,"MASCOT Score",175.2600000,,,,,,-0.1317600
LRNLGLGSDDEDDVEDDEGGGINGGDVKPVTGEER,ph,S,148,true,"SnRK2 protein kinase substrates",85,23776212,XCorr,4.5378957,1.0000000,,,,1.5558999848508E-6,
LRNLGLGSDDEDDVEDDEGGGINGGDVKPVTGEER,ph,S,148,true,"TOR Kinase and ABA Receptor",100,29290610,XCorr,3.8447692,1.0000000,,,,9.2560000553021E-8,
NLGLGSDDEDDVEDDEGGGINGGDVKPVTGEER,ph,S,148,true,"ABA-induced protein phosphorylation",35,20733066,,,,,,,,
NLGLGSDDEDDVEDDEGGGINGGDVKPVTGEER,ph,S,148,true,"STN8 phosphoproteome",38,21768351,"MASCOT Score",202.7700000,,,,,,-0.0476293
NLGLGSDDEDDVEDDEGGGINGGDVKPVTGEER,ph,S,148,true,"Chloroplast kinase substrates",60,19376835,"MASCOT Score",195.8400000,,,,,,-0.0476293
NLGLGSDDEDDVEDDEGGGINGGDVKPVTGEER,ph,S,148,true,"srk2dei ABA signaling phopshoproteomics",83,23572148,"MASCOT Score",219.0000000,,,,,,-0.0014000
NLGLGSDDEDDVEDDEGGGINGGDVKPVTGEER,ph,S,148,true,"LAXIC - ABA stress",84a,23660473,XCorr,7.4100000,0.9990000,,,,2.1600000840684E-14,
NLGLGSDDEDDVEDDEGGGINGGDVKPVTGEER,ph,S,148,true,"LAXIC - mannitol vs control",84b,23660473,XCorr,6.3200000,1.0000000,,,,2.7100000806968E-5,
NLGLGSDDEDDVEDDEGGGINGGDVKPVTGEER,ph,S,148,true,"SnRK2 protein kinase substrates",85,23776212,XCorr,5.6968207,1.0000000,,,,4.7489897451525E-16,
NLGLGSDDEDDVEDDEGGGINGGDVKPVTGEER,ph,S,148,true,"TOR Kinase and ABA Receptor",100,29290610,XCorr,5.5495553,1.0000000,,,,8.3680001816688E-10,
NLGLGSDDEDDVEDDEGGGINGGDVKPVTGEER,ph,S,148,true,"Lateral root-induction - NAA vs control",106,23328941,"MASCOT Score",84.0000000,,,,,,
NLGLGSDDEDDVEDDEGGGINGGDVKPVTGEER,ph,S,148,true,"Phospho cell culture sucrose/TOR",109,30833711,,,1.0000000,,,,,
NLGLGSDDEDDVEDDEGGGINGGDVKPVTGEER,ph,S,148,true,"Col-0 callus - FC Col-0 vs. Col-0 Xray",111a,31410901,,56.3100000,,0.4036853,0.0000000,NO,,1.3097435
NLGLGSDDEDDVEDDEGGGINGGDVKPVTGEER,ph,S,148,true,"Col-0 X-ray callus - FC Col-0 vs. Col-0 Xray",111b,31410901,,56.3100000,,0.4036853,0.0000000,NO,,1.3097435
NLGLGSDDEDDVEDDEGGGINGGDVKPVTGEER,ph,S,148,true,"atm callus - FC atm vs. atm Xray",111c,31410901,,56.3100000,,1.3584466,0.0000000,NO,,1.3097435
NLGLGSDDEDDVEDDEGGGINGGDVKPVTGEER,ph,S,148,true,"atm-3 X-ray callus - FC atm vs. atm Xray",111d,31410901,,56.3100000,,1.3584466,0.0000000,NO,,1.3097435
NLGLGSDDEDDVEDDEGGGINGGDVKPVTGEER,ph,S,148,true,"Tissue atlas Arabidopsis - ProteomicsDB",114,32188942,"MaxQuant score",350.8000000,1.0000000,,,,0,
EWVRPDMMLAEGEESEEEDEVLLPWEKNEEEQAAER,ph,S,197,true,"SnRK2 protein kinase substrates",85,23776212,XCorr,5.3832126,1.0000000,,,,1.4040300226701E-13,
EWVRPDMMLAEGEESEEEDEVLLPWEKNEEEQAAER,ph,S,197,true,"Tissue atlas Arabidopsis - ProteomicsDB",114,32188942,"MaxQuant score",51.8780000,1.0000000,,,,3.4768800105667E-6,
REWVRPDMMLAEGEESEEEDEVLLPWEK,ph,S,197,true,"TOR Kinase and ABA Receptor",100,29290610,XCorr,4.2693276,1.0000000,,,,5.7289998949273E-5,
EWVRPDMMLAEGEESEEEDEVLLPWEK,ph,S,197,true,"SnRK2 protein kinase substrates",85,23776212,XCorr,2.1071920,1.0000000,,,,0.027290599420667,
GPPVISNQMAGPK,ph,S,337,true,"srk2dei ABA signaling phopshoproteomics",83,23572148,"MASCOT Score",21.0000000,,,,,,-0.0007000
DDVEDNESDWDETDGESAISSIEEADMSSR,ph,S,826,true,"srk2dei ABA signaling phopshoproteomics",83,23572148,"MASCOT Score",27.0000000,,,,,,-0.0023000
DDVEDNESDWDETDGESAISSIEEADMSSR,ph,S,826,true,"TOR Kinase and ABA Receptor",100,29290610,XCorr,5.6929431,1.0000000,,,,7.071999789332E-6,
DDVEDNESDWDETDGESAISSIEEADMSSR,ph,T,831,true,"TOR Kinase and ABA Receptor",100,29290610,XCorr,4.0485926,0.9965000,,,,0.0013399999588728,
