Peptide,PTM,ModifiedAA,ModifiedPosition,PeptideUniqueToGene,ExperimentDesc,ExpID,PubmedID,ScoreType,IdentScore,LocProb,Log2FChange,PQ-val,QuantSig,PEP,MassErrorPPM
ILRGSPSK,ph,S,311,true,"TOR Kinase and ABA Receptor",100,29290610,XCorr,2.6100225,0.9269000,,,,0.02470999956131,
RASAGPGTPFNK,ph,S,727,true,"atm and atr DNA damage response",88,25561503,"MASCOT Score",75.0000000,1.0000000,,,,,-1.2300000
RASAGPGTPFNK,ph,S,727,true,"TOR Kinase and ABA Receptor",100,29290610,XCorr,3.8959434,0.9966000,,,,0.00033390001044609,
RASAGPGTPFNK,ph,S,727,true,"Tissue atlas Arabidopsis - ProteomicsDB",114,32188942,"MaxQuant score",179.5600000,1.0000000,,,,9.4038299356729E-20,
EILNSSPAQAPSR,ph,S,805,true,"atm and atr DNA damage response",88,25561503,"MASCOT Score",38.0000000,0.9940000,,,,,0.2000000
EILNSSPAQAPSRDS,ph,S,806,true,"atm and atr DNA damage response",88,25561503,"MASCOT Score",39.0000000,0.9960000,,,,,-0.4300000
EILNSSPAQAPSRDS,ph,S,806,true,"TOR Kinase and ABA Receptor",100,29290610,XCorr,3.3612113,0.8833000,,,,0.00095439999131486,
EILNSSPAQAPSR,ph,S,806,true,"STN8 phosphoproteome",38,21768351,"MASCOT Score",44.5400000,,,,,,-1.2782800
EILNSSPAQAPSR,ph,S,806,true,"atm and atr DNA damage response",88,25561503,"MASCOT Score",50.0000000,0.9470000,,,,,0.7400000
EILNSSPAQAPSR,ph,S,806,true,"TOR Kinase and ABA Receptor",100,29290610,XCorr,3.6042070,0.9151000,,,,0.00049489998491481,
EILNSSPAQAPSR,ph,S,806,true,"Tissue atlas Arabidopsis - ProteomicsDB",114,32188942,"MaxQuant score",225.3200000,0.9999350,,,,0,
EILNSSPAQAPSRDS,ph,S,812,true,"atm and atr DNA damage response",88,25561503,"MASCOT Score",39.0000000,0.9440000,,,,,-0.4300000
EILNSSPAQAPSRDS,ph,S,812,true,"Tissue atlas Arabidopsis - ProteomicsDB",114,32188942,"MaxQuant score",249.4700000,0.8103820,,,,0,
