Peptide,PTM,ModifiedAA,ModifiedPosition,PeptideUniqueToGene,ExperimentDesc,ExpID,PubmedID,ScoreType,IdentScore,LocProb,Log2FChange,PQ-val,QuantSig,PEP,MassErrorPPM
AEGLVLKGIMR,nt,A,2,true,"N-terminal ChaFRADIC",92,26010716,"MASCOT Score",22.1800000,,,,,0.010850000195205,
AEGLVLKGIMR,nt,A,2,true,"Stromal N-terminome",96,26371235,"MASCOT Score",79.4600000,,,,,,
AEGLVLKGIMR,nt,A,2,true,"Arg/N-end rule seed, prt6 vs. Wt",99,29168982,"MASCOT Score",39.2400000,,,,,0.058249998837709,-0.8260847
AEGLVLKGIM,nt,A,2,true,"N-term acetylation drought responses",5,26184543,,,,,,,,
AEGLVLKGIMRAHT,nta,A,2,true,"Arabidopsis translation initiation landscape - NTA",167a,35069635,,,,,,,,
AEGLVLKGIMR,nta,A,2,true,"Arg/N-end rule pathway Roots",80,25728785,"MASCOT Score",53.6400000,,,,,8.3539998740889E-6,
AEGLVLKGIMR,nta,A,2,true,"N-terminal ChaFRADIC",92,26010716,"MASCOT Score",22.1800000,,,,,0.010850000195205,
AEGLVLKGIMR,nta,A,2,true,"Stromal N-terminome",96,26371235,"MASCOT Score",79.4600000,,,,,,
AEGLVLKGIMR,nta,A,2,true,"Arg/N-end rule seed, prt6 vs. Wt",99,29168982,"MASCOT Score",39.2400000,,-0.0231389,0.9385816,NO,0.058249998837709,-0.8260847
AEGLVLKGIMR,nta,A,2,true,"FtsH12 N-terminome: WT / FtsH12 knockdown miRNA",118,33216923,"MaxQuant score",240.0400000,,,,,0,
AEGLVLKGIMR,nta,A,2,true,"HUNTER N-terminome: legumain, GluC and trypsin",119,31951383,"MaxQuant score",46.3900000,,,,,,
AEGLVLKGIM,nta,A,2,true,"N-term acetylation drought responses",5,26184543,,,,,,,,
AEGLVLK,nta,A,2,false,"Characterization plant N-terminal acetylation",6,22223895,"MASCOT Score",50.7600000,,,,,,
AEGLVLKGIMR,ub,K,8,true,"Arabidopsis ubiquitination COFRADIC",40,26744219,"MaxQuant Score",47.3020000,1.0000000,,,,0.0080000003799796,0.5750000
SGSWDGELR,nt,S,80,false,"Arg/N-end rule seed, prt6 vs. Wt",99,29168982,"MASCOT Score",45.5600000,,,,,0.030039999634027,-0.8563810
LWNTLGECK,ox,C,138,false,"Redox kickstart of mitochondria",112,31871212,,,,-0.7808301,0.0136391,YES,,
LWNTLGECK,sno,C,138,false,"Site-specific nitrosomeproteomic id - gsnor1-3",90a,25699590,XCorr,2.9415417,,,,,0.0024739999789745,-6.4290882
LWNTLGECK,sno,C,138,false,"Site-specific nitrosomeproteomic id - gsnor1-3",90b,25699590,XCorr,2.6700000,,,,,0.096150003373623,-6.8300000
LWNTLGECK,so,C,138,false,"Arabidopsis S-sulfenylation chemoproteomics",108,31578252,"pFind PSM Score",0.0669539,,0.9496100,,,,-0.3104637
EWVSCVR,ox,C,154,false,"SPEAR - 10 mM H2O2 / mock",138a,34619326,,,,0.8103946,0.0347902,YES,,
EWVSCVR,so,C,154,false,"S-sulfenylation site detection using YAP1C",110,32714340,,,,,,,,
VWNLQNCK,ox,C,183,false,"OxiTRAQ Arabidopsis - 5 mM H2O2 versus control",47,24376095,,,,0.5162698,0.0159259,YES,,
VWNLQNCK,so,C,183,false,"Arabidopsis S-sulfenylation chemoproteomics",108,31578252,"pFind PSM Score",0.0101430,,0.8247300,,,,-1.2718322
VWNLQNCK,so,C,183,false,"S-sulfenylation site detection using YAP1C",110,32714340,,,,,,,,
VWNLQNCKLR,ub,K,184,false,"upl3 mutant / wildtype",168,35926874,"MaxQuant score",115.7100000,1.0000000,0.4499575,0.6818600,NO,2.6801000785781E-5,-0.7863800
NSLVGHSGYLNTVAVSPDGSLCASGGK,so,C,208,true,"Arabidopsis S-sulfenylation chemoproteomics",108,31578252,"pFind PSM Score",0.0035803,,,,,,-0.1794714
NSLVGHSGYLNTVAVSPDGSLCASGGK,so,C,208,true,"S-sulfenylation site detection using YAP1C",110,32714340,,,,,,,,
KLYSLEAGSIIHSLCFSPNR,ub,K,227,false,"upl3 mutant / wildtype",168,35926874,"MaxQuant score",123.5500000,1.0000000,0.7748398,0.2701600,NO,3.8685600675572E-14,2.2569000
SEAEKNEGGVGTGNQKK,ac,K,292,true,"Quantitative Acetylproteomics",101,29440448,,,,,,,,
