Peptide,PTM,ModifiedAA,ModifiedPosition,PeptideUniqueToGene,ExperimentDesc,ExpID,PubmedID,ScoreType,IdentScore,LocProb,Log2FChange,PQ-val,QuantSig,PEP,MassErrorPPM
SLSAEKNKLHTGGLSR,nt,S,26,true,"HUNTER N-terminome: legumain, GluC and trypsin",119,31951383,"MaxQuant score",59.1500000,,,,,,
NKLHTGGLSRQSFPKGFVFGTATSAYQVEGETHQD,nt,N,32,true,"HUNTER N-terminome: legumain, GluC and trypsin",119,31951383,"MaxQuant score",63.4400000,,,,,,
QSFPKGFVFGTATSAYQVEGETHQDGR,nt,Q,42,true,"HUNTER N-terminome: legumain, GluC and trypsin",119,31951383,"MaxQuant score",72.5840000,,,,,,
TATSAYQVE,nt,T,52,false,"Arg/N-end rule seed, prt6 vs. Wt",99,29168982,"MASCOT Score",55.8500000,,-0.5078800,0.3573682,NO,0.00011130000348203,-0.5436925
NATAEITVDQYHR,ng,N,86,false,"Conserved N-glycosylation",74,22633491,"MaxQuant Score",176.1500000,1.0000000,,,,1.3280000331001E-26,-0.6330000
NATAEITVDQYHR,ng,N,86,false,"N-glycan occupancy Arabidopsis glycoproteins",87,23994444,"Ladder score",82.7000000,,,,,,
NATAEITVDQYHR,ng,N,86,false,"N-Glycopeptide Profiling in Arabidopsis Infloresce",132,27067053,"MOWSE score",21.6000000,,,,,0.0019000000320375,
NATAEITVDQYHR,ng,N,86,false,"N-linked Glycan Micro-heterogeneity Arabidopsis",134,29237727,,,,,,,,
NATAEITVDQYHR,ng,N,86,false,"UDP-GlcNAc transporter glycopeptide analysis",135,30224661,,,,,,,2.3474924217473E-17,0.7000000
YKEDVDLMKK,ac,K,107,true,"Quantitative Acetylproteomics",101,29440448,,,,,,,,
QVVKDFADYAEFCYKTFGDR,nt,Q,177,true,"HUNTER N-terminome: legumain, GluC and trypsin",119,31951383,"MaxQuant score",,,,,,,
VKNWMTFNEPR,ac,K,198,false,"Quantitative Acetylproteomics",101,29440448,,,,,,,,
AFGNCTEGNSATEPYIVTHHLILAHAAAVQR,ng,N,230,true,"Conserved N-glycosylation",74,22633491,"MaxQuant Score",252.8600000,1.0000000,,,,0,2.8800000
YYQAKQK,ac,K,265,true,"Quantitative Acetylproteomics",101,29440448,,,,,,,,
SKADNLAAQR,ac,K,286,true,"Quantitative Acetylproteomics",101,29440448,,,,,,,,
TMQNIVKER,ac,K,321,true,"Quantitative Acetylproteomics",101,29440448,,,,,,,,
ERLPKFTEK,ac,K,326,true,"Quantitative Acetylproteomics",101,29440448,,,,,,,,
QYTTYYMSEPHPTTKPKD,nt,Q,346,true,"HUNTER N-terminome: legumain, GluC and trypsin",119,31951383,"MaxQuant score",84.4930000,,,,,,
YGNPTMILSENGMDDPGNVTLAQGLHDTTR,ng,N,427,true,"Conserved N-glycosylation",74,22633491,"MaxQuant Score",322.5900000,1.0000000,,,,0,1.9230000
YGNPTMILSENGMDDPGNVTLAQGLHDTTR,ng,N,427,true,"N-linked Glycan Micro-heterogeneity Arabidopsis",134,29237727,,,,,,,,
YGNPTMILSENGMDDPGNVTLAQGLHDTTR,ng,N,427,true,"UDP-GlcNAc transporter glycopeptide analysis",135,30224661,,,,,,,5.035543596682E-12,1.0000000
