Peptide,PTM,ModifiedAA,ModifiedPosition,PeptideUniqueToGene,ExperimentDesc,ExpID,PubmedID,ScoreType,IdentScore,LocProb,Log2FChange,PQ-val,QuantSig,PEP,MassErrorPPM
ICDFGLAR,ox,C,166,false,"SPEAR - 50 mM H2O2 / mock",138b,34619326,,,,1.8133062,0.0349409,YES,,
ICDFGLAR,so,C,166,false,"S-sulfenylation site detection using YAP1C",110,32714340,,,,,,,,
VSFNDAPSAIFWTDYVATR,ph,Y,187,true,"Large-scale phosphorylation discovery",44,23111157,XCorr,3.0990000,,,,,,
VSFNDAPSAIFWTDYVATR,ph,Y,187,true,"Tyrosine phosphorylation - flg22 vs mock",105,22074104,"MASCOT Score",74.4000000,,1.2600000,,YES,,
VSFNDAPSAIFWTDYVATR,ph,T,190,true,"Tyrosine phosphorylation - flg22 vs mock",105,22074104,"MASCOT Score",74.4300000,,,,,,1.9924085
QFAHLEENYGKGEKGSPLQR,ph,S,401,true,"Tissue atlas Arabidopsis - ProteomicsDB",114,32188942,"MaxQuant score",147.6300000,1.0000000,,,,3.4621799634772E-19,
GEKGSPLQR,ph,S,401,true,"atm and atr DNA damage response",88,25561503,"MASCOT Score",26.0000000,1.0000000,,,,,-0.2900000
QHASLPR,ph,S,409,false,"TOR Kinase and ABA Receptor",100,29290610,XCorr,2.1208539,1.0000000,,,,0.01541000045836,
QHASLPR,ph,S,409,false,"Tissue atlas Arabidopsis - ProteomicsDB",114,32188942,"MaxQuant score",116.1200000,1.0000000,,,,0.0073106801137328,
SIASLVTTLESPPTSQHEGSDYR,ph,S,443,true,"Large-scale phosphorylation discovery",44,23111157,XCorr,4.2600000,,,,,,
SIASLVTTLESPPTSQHEGSDYR,ph,S,443,true,"TOR Kinase and ABA Receptor",100,29290610,XCorr,3.6993558,0.9674000,,,,0.0013549999566749,
SIASLVTTLESPPTSQHEGSDYR,ph,S,443,true,"Tissue atlas Arabidopsis - ProteomicsDB",114,32188942,"MaxQuant score",286.8000000,0.9998060,,,,0,
NGTSQTGYSAR,ph,S,464,true,"Tissue atlas Arabidopsis - ProteomicsDB",114,32188942,"MaxQuant score",156.5200000,0.9976330,,,,1.7614899816554E-10,
SASISASKCIGMKPR,ph,S,473,true,"Tissue atlas Arabidopsis - ProteomicsDB",114,32188942,"MaxQuant score",94.0570000,0.9807960,,,,2.994610076712E-5,
SASISASK,ph,S,473,false,"atm and atr DNA damage response",88,25561503,"MASCOT Score",43.0000000,1.0000000,,,,,-1.9200000
SASISASKCIGMKPR,ph,S,477,true,"Tissue atlas Arabidopsis - ProteomicsDB",114,32188942,"MaxQuant score",94.0570000,0.9339240,,,,2.994610076712E-5,
NKSEYGESNNDTVDALSQK,ph,S,488,true,"Tissue atlas Arabidopsis - ProteomicsDB",114,32188942,"MaxQuant score",53.0370000,0.9597360,,,,0.0041955299675465,
NKSEYGESNNDTVDALSQK,ph,S,493,true,"Tissue atlas Arabidopsis - ProteomicsDB",114,32188942,"MaxQuant score",59.8640000,0.8907320,,,,0.00040529298712499,
