Peptide,PTM,ModifiedAA,ModifiedPosition,PeptideUniqueToGene,ExperimentDesc,ExpID,PubmedID,ScoreType,IdentScore,LocProb,Log2FChange,PQ-val,QuantSig,PEP,MassErrorPPM
SQPASYGFYSPAR,ph,S,348,true,"Tissue atlas Arabidopsis - ProteomicsDB",114,32188942,"MaxQuant score",55.5460000,0.9955780,,,,0.014470599591732,
DEADDEGSFTR,ph,S,359,true,"Tissue atlas Arabidopsis - ProteomicsDB",114,32188942,"MaxQuant score",196.7000000,0.9605050,,,,1.3574699732388E-18,
EENIKSDHEADVFGLICK,ph,S,404,true,"Tissue atlas Arabidopsis - ProteomicsDB",114,32188942,"MaxQuant score",296.0600000,1.0000000,,,,0,
ERSVLWLR,ph,S,425,false,"Tissue atlas Arabidopsis - ProteomicsDB",114,32188942,"MaxQuant score",72.8870000,1.0000000,,,,0.0037342100404203,
HQAFFLDGKPDENGNMSTLDASQDMTGSFSPSSPPHYQK,ph,S,525,true,"Tissue atlas Arabidopsis - ProteomicsDB",114,32188942,"MaxQuant score",107.0400000,0.7946380,,,,9.8090892502737E-44,
NVSPLEEYSFIK,ph,S,655,true,"Tissue atlas Arabidopsis - ProteomicsDB",114,32188942,"MaxQuant score",217.6800000,1.0000000,,,,4.8719294033797E-39,
NVSPLEEYSFIK,ph,S,661,true,"Tissue atlas Arabidopsis - ProteomicsDB",114,32188942,"MaxQuant score",116.1900000,0.9999880,,,,4.2292798752896E-5,
LLSPECVPK,sno,C,982,true,"hot5-4 / wildtype, FAT-switch S-nitrosoproteome",169,37277371,,,,0.0815425,0.6099473,NO,,
