Peptide,PTM,ModifiedAA,ModifiedPosition,PeptideUniqueToGene,ExperimentDesc,ExpID,PubmedID,ScoreType,IdentScore,LocProb,Log2FChange,PQ-val,QuantSig,PEP,MassErrorPPM
DLAADKSALLSFR,nt,D,30,true,"HUNTER N-terminome: legumain, GluC and trypsin",119,31951383,"MaxQuant score",82.1020000,,,,,,
DLAADKSALLSFR,nt,D,30,true,"Arabidopsis translation initiation landscape - NT",167b,35069635,,,,,,,,
QTSPCNWTGVLCDGGR,ng,N,61,true,"Conserved N-glycosylation",74,22633491,"MaxQuant Score",139.1500000,1.0000000,,,,3.9380001012118E-21,-0.1820000
LPGETLSGHIPEGIFGNLTQLR,ng,N,93,true,"Conserved N-glycosylation",74,22633491,"MaxQuant Score",225.7800000,1.0000000,,,,0,-0.8870000
LKTLYLENNK,ac,K,170,true,"Quantitative Acetylproteomics",101,29440448,,,,,,,,
LSGSLLDLDLSLDQFNVSNNLLNGSIPK,ng,N,194,true,"Conserved N-glycosylation",74,22633491,"MaxQuant Score",261.1700000,1.0000000,,,,0,-0.2690000
LSGSLLDLDLSLDQFNVSNNLLNGSIPK,ng,N,201,true,"Conserved N-glycosylation",74,22633491,"MaxQuant Score",261.1700000,0.9970000,,,,0,-0.2690000
AIDLATIK,ph,T,303,true,"Tissue atlas Arabidopsis - ProteomicsDB",114,32188942,"MaxQuant score",117.0200000,1.0000000,,,,0.0085723903030157,
AIDLATIKHHEVEIPGEKAAVEAPENR,ub,K,305,true,"upl3 mutant / wildtype",168,35926874,"MaxQuant score",88.2830000,1.0000000,1.1249898,0.1498570,NO,3.2829700558068E-7,1.1942000
HEVEIPGEKAAVEAPENRSY,nt,H,307,true,"Arabidopsis translation initiation landscape - NT",167b,35069635,,,,,,,,
AIDLATIKHHEVEIPGEKAAVEAPENR,ub,K,315,true,"upl3 mutant / wildtype",168,35926874,"MaxQuant score",88.2830000,1.0000000,1.1249898,0.1498570,NO,3.2829700558068E-7,1.1942000
HHEVEIPGEKAAVEAPENR,ub,K,315,true,"Ubiquitination Membrane Proteins",120,33585938,,,,,,,,
HHEVEIPGEKAAVEAPENR,ub,K,315,true,"upl3 mutant / wildtype",168,35926874,"MaxQuant score",90.3850000,1.0000000,-0.2142402,0.6823400,NO,1.9261899808498E-7,-0.0229380
SYVNEYSPSAVK,ph,S,325,true,"Conserved plant phosphoproteome - Arabidopsis",61a,20466843,"MASCOT Score",59.0000000,1.0000000,,,,,
SYVNEYSPSAVK,ph,S,325,true,"atm and atr DNA damage response",88,25561503,"MASCOT Score",47.0000000,0.9970000,,,,,-0.6800000
SYVNEYSPSAVK,ph,S,325,true,"Tissue atlas Arabidopsis - ProteomicsDB",114,32188942,"MaxQuant score",136.1000000,0.9996190,,,,1.7382999430993E-5,
SYVNEYSPSAVK,ph,S,331,true,"Plasmamembrane phosphorylation",20,15308754,,,,,,,,
SYVNEYSPSAVK,ph,S,331,true,"Plasmembrane Ph Immune Responses",25,17651370,,,,,,,,
SYVNEYSPSAVK,ph,S,331,true,"Phosphorylation nuclei-enriched fractions",28,19245862,,,,,,,,
SYVNEYSPSAVK,ph,S,331,true,"Phytohormone-responsive phosphoproteins",34,20374526,"MASCOT Score",50.0000000,,,,,,0.9726220
SYVNEYSPSAVK,ph,S,331,true,"STN8 phosphoproteome",38,21768351,"MASCOT Score",44.1500000,,,,,,-1.9895700
SYVNEYSPSAVK,ph,S,331,true,"Phosphoproteome ethylene-regulated time response",46,24043427,"MASCOT Score",39.4800000,,,,,,-2.5807000
SYVNEYSPSAVK,ph,S,331,true,"Conserved plant phosphoproteome - Arabidopsis",61a,20466843,"MASCOT Score",59.0000000,1.0000000,,,,,
SYVNEYSPSAVK,ph,S,331,true,"srk2dei ABA signaling phopshoproteomics",83,23572148,"MASCOT Score",56.0000000,,,,,,0.0000000
SYVNEYSPSAVK,ph,S,331,true,"LAXIC - ABA stress",84a,23660473,XCorr,2.8500000,0.9060000,,,,0.051977898925543,
SYVNEYSPSAVK,ph,S,331,true,"SnRK2 protein kinase substrates",85,23776212,XCorr,2.5539217,0.9620000,,,,4.8555998546362E-6,
SYVNEYSPSAVK,ph,S,331,true,"atm and atr DNA damage response",88,25561503,"MASCOT Score",72.0000000,0.9520000,,,,,0.8000000
SYVNEYSPSAVK,ph,S,331,true,"TOR Kinase and ABA Receptor",100,29290610,XCorr,4.1143832,0.9309000,,,,3.9719998312648E-5,
SYVNEYSPSAVK,ph,S,331,true,"Lateral root-induction - NAA vs control",106,23328941,"MASCOT Score",30.0000000,,,,,,
SYVNEYSPSAVK,ph,S,331,true,"Phospho cell culture sucrose/TOR",109,30833711,,,0.9512100,,,,,
SYVNEYSPSAVK,ph,S,331,true,"Tissue atlas Arabidopsis - ProteomicsDB",114,32188942,"MaxQuant score",262.4300000,0.9969470,,,,0,
SYVNEYSPSAVK,ph,S,331,true,"Touch-induced phosphorylation: 40s touch vs untouc",136,30291188,"MASCOT score",72.0800000,,-0.0375032,0.9168858,NO,,5.3496077
SYVNEYSPSAVK,ph,S,333,true,"Lateral root-induction - NAA vs control",106,23328941,"MASCOT Score",30.0000000,,,,,,
SYVNEYSPSAVK,ph,S,333,true,"Tissue atlas Arabidopsis - ProteomicsDB",114,32188942,"MaxQuant score",179.2100000,0.8390340,,,,1.2815399370359E-19,
SYVNEYSPSAVKAVEVNSSGMK,ub,K,336,true,"Ubiquitination Membrane Proteins",120,33585938,,,,,,,,
AVEVNSSGMK,ph,S,342,true,"Plasmembrane Ph Immune Responses",25,17651370,,,,,,,,
AVEVNSSGMK,ph,S,342,true,"Tissue atlas Arabidopsis - ProteomicsDB",114,32188942,"MaxQuant score",94.1910000,0.8723450,,,,0.00070236797910184,
KLVFFGNATK,ub,K,347,false,"Ubiquitination Membrane Proteins",120,33585938,,,,,,,,
KLVFFGNATK,ub,K,347,false,"upl3 mutant / wildtype",168,35926874,"MaxQuant score",91.3130000,1.0000000,1.9313048,,,0.00067751097958535,0.1489200
VFDLEDLLRASAEVLGK,ph,S,367,false,"Arabidopsis root NAA phosphoproteome",18a,27643528,"MaxQuant Score",58.6930000,1.0000000,,,,2.325999957975E-5,-0.0650000
VFDLEDLLRASAEVLGK,ph,S,367,false,"Plasmamembrane phosphorylation",20,15308754,,,,,,,,
VFDLEDLLRASAEVLGK,ph,S,367,false,"Phosphorylation Early Elicitor Signaling",23,17317660,,,,,,,,
VFDLEDLLRASAEVLGK,ph,S,367,false,"Plasmembrane Ph Immune Responses",25,17651370,,,,,,,,
VFDLEDLLRASAEVLGK,ph,S,367,false,"Phosphoproteome ethylene-regulated time response",46,24043427,"MASCOT Score",101.2100000,,,,,,-11.3611000
VFDLEDLLRASAEVLGK,ph,S,367,false,"Tyrosine phosphorylation in Arabidopsis",59,18463617,"MASCOT Score",32.0000000,,,,,,-1.6376847
VFDLEDLLRASAEVLGK,ph,S,367,false,"Conserved plant phosphoproteome - Arabidopsis",61a,20466843,"MASCOT Score",61.0000000,1.0000000,,,,,
VFDLEDLLRASAEVLGK,ph,S,367,false,"SnRK2 protein kinase substrates",85,23776212,XCorr,2.7219119,1.0000000,,,,3.467350104952E-12,
VFDLEDLLRASAEVLGK,ph,S,367,false,"TOR Kinase and ABA Receptor",100,29290610,XCorr,3.3776073,1.0000000,,,,2.6949999210046E-7,
VFDLEDLLRASAEVLGK,ph,S,367,false,"Col-0 callus - FC Col-0 vs. Col-0 Xray",111a,31410901,,63.8100000,,0.5765731,0.0000000,NO,,0.7980760
VFDLEDLLRASAEVLGK,ph,S,367,false,"Col-0 X-ray callus - FC Col-0 vs. Col-0 Xray",111b,31410901,,63.8100000,,0.5765731,0.0000000,NO,,0.7980760
VFDLEDLLRASAEVLGK,ph,S,367,false,"atm callus - FC atm vs. atm Xray",111c,31410901,,63.8100000,,-0.6561934,0.0000000,NO,,0.7980760
VFDLEDLLRASAEVLGK,ph,S,367,false,"atm-3 X-ray callus - FC atm vs. atm Xray",111d,31410901,,63.8100000,,-0.6561934,0.0000000,NO,,0.7980760
VFDLEDLLRASAEVLGK,ph,S,367,false,"Tissue atlas Arabidopsis - ProteomicsDB",114,32188942,"MaxQuant score",305.8700000,1.0000000,,,,0,
VFDLEDLLRASAEVLGK,ph,S,367,false,"Touch-induced phosphorylation: 40s touch vs untouc",136,30291188,"MASCOT score",103.6800000,,-0.0035125,0.9853140,NO,,1.9146672
ASAEVLGK,ph,S,367,false,"Plasmamembrane phosphorylation",20,15308754,,,,,,,,
ASAEVLGK,ph,S,367,false,"Phosphorylation Early Elicitor Signaling",23,17317660,,,,,,,,
ASAEVLGK,ph,S,367,false,"Sucrose-induced phosphorylation",24,17586839,,,,,,,,
ASAEVLGK,ph,S,367,false,"Plasmembrane Ph Immune Responses",25,17651370,,,,,,,,
ASAEVLGK,ph,S,367,false,"Immuno-dot blot phosphorylation",31,19341826,"MASCOT Score",43.1300000,,,,,,10.7296000
ASAEVLGK,ph,S,367,false,"Phytohormone-responsive phosphoproteins",34,20374526,"MASCOT Score",50.0000000,,,,,,10.7581000
ASAEVLGK,ph,S,367,false,"Tyrosine phosphorylation in Arabidopsis",59,18463617,"MASCOT Score",47.0000000,,,,,,-0.4687165
ASAEVLGK,ph,S,367,false,"srk2dei ABA signaling phopshoproteomics",83,23572148,"MASCOT Score",44.0000000,,,,,,0.0004000
ASAEVLGK,ph,S,367,false,"LAXIC - mannitol vs control",84b,23660473,XCorr,2.0300000,1.0000000,-1.2490629,,NO,0.0014310600236058,
ASAEVLGK,ph,S,367,false,"SnRK2 protein kinase substrates",85,23776212,XCorr,3.0863461,1.0000000,,,,0.059298899024725,
ASAEVLGK,ph,S,367,false,"atm and atr DNA damage response",88,25561503,"MASCOT Score",58.0000000,1.0000000,,,,,1.7300000
ASAEVLGK,ph,S,367,false,"Phospho cell culture sucrose/TOR",109,30833711,,,1.0000000,,,,,
ASAEVLGK,ph,S,367,false,"Col-0 callus - FC Col-0 vs. Col-0 Xray",111a,31410901,,35.6000000,,0.2389819,0.0000000,NO,,-0.0113007
ASAEVLGK,ph,S,367,false,"Col-0 X-ray callus - FC Col-0 vs. Col-0 Xray",111b,31410901,,35.6000000,,0.2389819,0.0000000,NO,,-0.0113007
ASAEVLGK,ph,S,367,false,"atm callus - FC atm vs. atm Xray",111c,31410901,,31.6600000,,-1.6865110,0.0000000,NO,,-0.0674947
ASAEVLGK,ph,S,367,false,"atm-3 X-ray callus - FC atm vs. atm Xray",111d,31410901,,31.6600000,,-1.6865110,0.0000000,NO,,-0.0674947
ASAEVLGK,ph,S,367,false,"Tissue atlas Arabidopsis - ProteomicsDB",114,32188942,"MaxQuant score",114.9700000,1.0000000,,,,8.8670400145929E-5,
VSDFGLAQLVSASSTTPNR,ph,S,519,true,"Phosphorylation Early Elicitor Signaling",23,17317660,,,,,,,,
VSDFGLAQLVSASSTTPNR,ph,T,521,true,"TOR Kinase and ABA Receptor",100,29290610,XCorr,5.2228527,0.9826000,,,,2.1940000038967E-8,
VSDFGLAQLVSASSTTPNR,ph,T,521,true,"Col-0 callus - FC Col-0 vs. Col-0 Xray",111a,31410901,,62.8200000,,0.8528464,0.0000000,NO,,0.8405406
VSDFGLAQLVSASSTTPNR,ph,T,521,true,"Col-0 X-ray callus - FC Col-0 vs. Col-0 Xray",111b,31410901,,62.8200000,,0.8528464,0.0000000,NO,,0.8405406
VSDFGLAQLVSASSTTPNR,ph,T,521,true,"atm callus - FC atm vs. atm Xray",111c,31410901,,62.8200000,,1.9507551,0.0000000,NO,,0.8405406
VSDFGLAQLVSASSTTPNR,ph,T,521,true,"atm-3 X-ray callus - FC atm vs. atm Xray",111d,31410901,,62.8200000,,1.9507551,0.0000000,NO,,0.8405406
