Peptide,PTM,ModifiedAA,ModifiedPosition,PeptideUniqueToGene,ExperimentDesc,ExpID,PubmedID,ScoreType,IdentScore,LocProb,Log2FChange,PQ-val,QuantSig,PEP,MassErrorPPM
VGLKISSAAE,nt,V,38,true,"Arg/N-end rule seed, prt6 vs. Wt",99,29168982,"MASCOT Score",32.1000000,,,,,0.001674999948591,-1.1525977
VGLKISSAAE,nta,V,38,true,"Arg/N-end rule seed, prt6 vs. Wt",99,29168982,"MASCOT Score",32.1000000,,-0.0758017,0.7082105,NO,0.001674999948591,-1.1525977
AAESEPDLSVTVNGLKMPNPFVIGSGPPGTNYTVMKR,nt,A,45,true,"HUNTER N-terminome: legumain, GluC and trypsin",119,31951383,"MaxQuant score",84.5520000,,,,,,
AAESEPDLSVTVN,nt,A,45,true,"HUNTER N-terminome: legumain, GluC and trypsin",119,31951383,"MaxQuant score",127.3000000,,,,,,
AAESEPDLSVTVNGLK,nta,A,45,true,"Characterization plant N-terminal acetylation",6,22223895,"MASCOT Score",73.9600000,,,,,,
TLRPEPCVEGYSTPGGYSYK,sno,C,274,true,"Site-specific nitrosomeproteomic id - gsnor1-3",90a,25699590,XCorr,2.5000000,,,,,0.047100000083447,-5.7300000
TLRPEPCVEGYSTPGGYSYK,sno,C,274,true,"Site-specific nitrosomeproteomic id - gsnor1-3",90b,25699590,XCorr,3.9600000,,,,,0.00046119999024086,-5.8000000
MMKSEFSEDR,ac,K,305,true,"Quantitative Acetylproteomics",101,29440448,,,,,,,,
TLCAELK,sno,C,355,false,"hot5-4 / wildtype, FAT-switch S-nitrosoproteome",169,37277371,,,,,,,,
