Peptide,PTM,ModifiedAA,ModifiedPosition,PeptideUniqueToGene,ExperimentDesc,ExpID,PubmedID,ScoreType,IdentScore,LocProb,Log2FChange,PQ-val,QuantSig,PEP,MassErrorPPM
VYNLVEEEGSLESDDDKVKR,ph,S,97,false,"Tissue atlas Arabidopsis - ProteomicsDB",114,32188942,"MaxQuant score",308.3900000,1.0000000,,,,0,
VYNLVEEEGSLESDDDKVK,ph,S,97,false,"Conserved plant phosphoproteome - Arabidopsis",61a,20466843,"MASCOT Score",47.0000000,1.0000000,,,,,
VYNLVEEEGSLESDDDKVK,ph,S,97,false,"srk2dei ABA signaling phopshoproteomics",83,23572148,"MASCOT Score",36.0000000,,,,,,0.0005000
VYNLVEEEGSLESDDDKVK,ph,S,97,false,"Phospho cell culture sucrose/TOR",109,30833711,,,1.0000000,,,,,
VYNLVEEEGSLESDDDKVK,ph,S,97,false,"Col-0 callus - FC Col-0 vs. Col-0 Xray",111a,31410901,,71.8800000,,0.6514969,0.0000000,NO,,1.0197930
VYNLVEEEGSLESDDDKVK,ph,S,97,false,"Col-0 X-ray callus - FC Col-0 vs. Col-0 Xray",111b,31410901,,71.8800000,,0.6514969,0.0000000,NO,,1.0197930
VYNLVEEEGSLESDDDKVK,ph,S,97,false,"atm callus - FC atm vs. atm Xray",111c,31410901,,71.8800000,,-3.4974467,0.0000000,NO,,1.0197930
VYNLVEEEGSLESDDDKVK,ph,S,97,false,"atm-3 X-ray callus - FC atm vs. atm Xray",111d,31410901,,71.8800000,,-3.4974467,0.0000000,NO,,1.0197930
VYNLVEEEGSLESDDDK,ph,S,97,false,"Tyrosine phosphorylation in Arabidopsis",59,18463617,"MASCOT Score",72.0000000,,,,,,-1.6338118
VYNLVEEEGSLESDDDK,ph,S,97,false,"Conserved plant phosphoproteome - Arabidopsis",61a,20466843,"MASCOT Score",72.0000000,1.0000000,,,,,
VYNLVEEEGSLESDDDK,ph,S,97,false,"srk2dei ABA signaling phopshoproteomics",83,23572148,"MASCOT Score",47.0000000,,,,,,-0.0002000
VYNLVEEEGSLESDDDK,ph,S,97,false,"Brassinosteroid-Regulated Phosphorylation Dynamics",94,26187819,"MaxQuant Score",168.3500000,1.0000000,,,,2.6980000485387E-15,1.4380000
VYNLVEEEGSLESDDDKVKR,ph,S,100,false,"Chloroplast kinase substrates",60,19376835,"MASCOT Score",44.1200000,,,,,,0.1780370
VYNLVEEEGSLESDDDKVKR,ph,S,100,false,"SnRK2 protein kinase substrates",85,23776212,XCorr,2.2322192,0.8070000,,,,1.609270050551E-9,
VYNLVEEEGSLESDDDKVKR,ph,S,100,false,"Tissue atlas Arabidopsis - ProteomicsDB",114,32188942,"MaxQuant score",425.1100000,1.0000000,,,,0,
VYNLVEEEGSLESDDDKVK,ph,S,100,false,"Conserved plant phosphoproteome - Arabidopsis",61a,20466843,"MASCOT Score",47.0000000,1.0000000,,,,,
VYNLVEEEGSLESDDDKVK,ph,S,100,false,"srk2dei ABA signaling phopshoproteomics",83,23572148,"MASCOT Score",36.0000000,,,,,,0.0005000
VYNLVEEEGSLESDDDKVK,ph,S,100,false,"Col-0 callus - FC Col-0 vs. Col-0 Xray",111a,31410901,,71.8800000,,0.6514969,0.0000000,NO,,1.0197930
VYNLVEEEGSLESDDDKVK,ph,S,100,false,"Col-0 X-ray callus - FC Col-0 vs. Col-0 Xray",111b,31410901,,71.8800000,,0.6514969,0.0000000,NO,,1.0197930
VYNLVEEEGSLESDDDKVK,ph,S,100,false,"atm callus - FC atm vs. atm Xray",111c,31410901,,71.8800000,,-3.4974467,0.0000000,NO,,1.0197930
VYNLVEEEGSLESDDDKVK,ph,S,100,false,"atm-3 X-ray callus - FC atm vs. atm Xray",111d,31410901,,71.8800000,,-3.4974467,0.0000000,NO,,1.0197930
VYNLVEEEGSLESDDDK,ph,S,100,false,"Conserved plant phosphoproteome - Arabidopsis",61a,20466843,"MASCOT Score",72.0000000,1.0000000,,,,,
VYNLVEEEGSLESDDDK,ph,S,100,false,"srk2dei ABA signaling phopshoproteomics",83,23572148,"MASCOT Score",47.0000000,,,,,,-0.0002000
VYNLVEEEGSLESDDDK,ph,S,100,false,"Brassinosteroid-Regulated Phosphorylation Dynamics",94,26187819,"MaxQuant Score",168.3500000,1.0000000,,,,2.6980000485387E-15,1.4380000
ILKEESSDDNEVGGWTGWTEQVSGR,ph,S,519,false,"Phospho cell culture sucrose/TOR",109,30833711,,,0.9996250,,,,,
GLDEEMEDENSKPEDDTEAMLK,ph,S,567,false,"Phospho cell culture sucrose/TOR",109,30833711,,,0.9157750,,,,,
