Peptide,PTM,ModifiedAA,ModifiedPosition,PeptideUniqueToGene,ExperimentDesc,ExpID,PubmedID,ScoreType,IdentScore,LocProb,Log2FChange,PQ-val,QuantSig,PEP,MassErrorPPM
ASNLPMSPQLEQIHGEIR,nt,A,2,true,"Arg/N-end rule seed, prt6 vs. Wt",99,29168982,"MASCOT Score",51.8900000,,,,,0.0049200002104044,-2.0258072
ASNLPMSPQLE,nt,A,2,true,"Arg/N-end rule seed, prt6 vs. Wt",99,29168982,"MASCOT Score",26.6200000,,,,,0.00040630000876263,0.3484769
ASNLPMSPQLEQIHGEIR,nta,A,2,true,"Arg/N-end rule pathway Roots",80,25728785,"MASCOT Score",83.0600000,,,,,2.416000066674E-9,
ASNLPMSPQLEQIHGEIR,nta,A,2,true,"Arg/N-end rule seed, prt6 vs. Wt",99,29168982,"MASCOT Score",51.8900000,,,,,0.0049200002104044,-2.0258072
ASNLPMSPQLEQIHGEIR,nta,A,2,true,"HUNTER N-terminome: legumain, GluC and trypsin",119,31951383,"MaxQuant score",71.5480000,,,,,,
ASNLPMSPQLEQIHGEIR,nta,A,2,true,"Arabidopsis translation initiation landscape - NTA",167a,35069635,,,,,,,,
ASNLPMSPQLE,nta,A,2,true,"Arg/N-end rule seed, prt6 vs. Wt",99,29168982,"MASCOT Score",26.6200000,,,,,0.00040630000876263,0.3484769
ASNLPMSPQLEQIHGEIR,ph,S,3,true,"Tissue atlas Arabidopsis - ProteomicsDB",114,32188942,"MaxQuant score",130.2400000,0.9999910,,,,6.9784998939714E-15,
LDKIKDSTR,ub,K,34,true,"Arabidopsis ubiquitination COFRADIC",40,26744219,"MaxQuant Score",56.4040000,0.9920000,,,,0.010999999940395,-0.0170000
QLEELTDKMR,ac,K,51,false,"Quantitative Acetylproteomics",101,29440448,,,,,,,,
DEEARNSPEVNKQLNDEK,ph,S,74,true,"STN8 phosphoproteome",38,21768351,"MASCOT Score",53.3700000,,,,,,-0.8270070
DEEARNSPEVNKQLNDEK,ph,S,74,true,"Chloroplast kinase substrates",60,19376835,"MASCOT Score",52.3900000,,,,,,-0.8270070
ELKDEEARNSPEVNK,ph,S,74,true,"Tissue atlas Arabidopsis - ProteomicsDB",114,32188942,"MaxQuant score",208.4000000,1.0000000,,,,1.4012984643248E-45,
DEEARNSPEVNK,ph,S,74,true,"TOR Kinase and ABA Receptor",100,29290610,XCorr,3.4627688,1.0000000,,,,0.0012229999992996,
