Peptide,PTM,ModifiedAA,ModifiedPosition,PeptideUniqueToGene,ExperimentDesc,ExpID,PubmedID,ScoreType,IdentScore,LocProb,Log2FChange,PQ-val,QuantSig,PEP,MassErrorPPM
KSSDKFNPNDSVEIPR,ph,S,331,true,"Tissue atlas Arabidopsis - ProteomicsDB",114,32188942,"MaxQuant score",118.3200000,0.9235150,,,,5.0556600683649E-8,
KSSDKFNPNDSVEIPR,ph,S,332,true,"Large-scale phosphorylation discovery",44,23111157,XCorr,4.4240000,,,,,,
KSSDKFNPNDSVEIPR,ph,S,332,true,"SnRK2 protein kinase substrates",85,23776212,XCorr,2.6256247,0.9430000,,,,6.6577898749642E-10,
KSSDKFNPNDSVEIPR,ph,S,332,true,"Phospho cell culture sucrose/TOR",109,30833711,,,0.9758860,,,,,
KSSDKFNPNDSVEIPR,ph,S,332,true,"Tissue atlas Arabidopsis - ProteomicsDB",114,32188942,"MaxQuant score",240.4500000,0.9995800,,,,0,
VGGEVNDEEAPLITSR,ph,T,359,true,"Tissue atlas Arabidopsis - ProteomicsDB",114,32188942,"MaxQuant score",177.6400000,0.8882100,,,,1.3345100308361E-20,
VGGEVNDEEAPLITSRLSHIGR,ph,S,363,true,"TOR Kinase and ABA Receptor",100,29290610,XCorr,2.8955264,0.9508000,,,,0.018409999087453,
LSHIGRTQLGNHAA,ph,T,368,true,"Tissue atlas Arabidopsis - ProteomicsDB",114,32188942,"MaxQuant score",78.0780000,0.9999770,,,,0.00026147998869419,
