Peptide,PTM,ModifiedAA,ModifiedPosition,PeptideUniqueToGene,ExperimentDesc,ExpID,PubmedID,ScoreType,IdentScore,LocProb,Log2FChange,PQ-val,QuantSig,PEP,MassErrorPPM
SNATTLPVTQSPR,ph,T,53,true,"Phospho cell culture sucrose/TOR",109,30833711,,,0.9362650,,,,,
SNATTLPVTQSPR,ph,T,53,true,"Tissue atlas Arabidopsis - ProteomicsDB",114,32188942,"MaxQuant score",197.1900000,0.9896600,,,,3.3803200160156E-30,
SNATTLPVTQSPR,ph,T,57,true,"atm and atr DNA damage response",88,25561503,"MASCOT Score",29.0000000,0.9930000,,,,,-0.2700000
SNATTLPVTQSPR,ph,T,57,true,"Lateral root-induction - NAA vs control",106,23328941,"MASCOT Score",24.0000000,,,,,,
RSNATTLPVTQSPR,ph,S,59,true,"Tissue atlas Arabidopsis - ProteomicsDB",114,32188942,"MaxQuant score",156.2500000,0.9987590,,,,6.7426997318876E-10,
SNATTLPVTQSPR,ph,S,59,true,"Large-scale phosphorylation discovery",44,23111157,XCorr,3.8080000,,,,,,
SNATTLPVTQSPR,ph,S,59,true,"Tyrosine phosphorylation in Arabidopsis",59,18463617,"MASCOT Score",61.0000000,,,,,,-1.1029310
SNATTLPVTQSPR,ph,S,59,true,"LAXIC - ABA stress",84a,23660473,XCorr,2.5800000,1.0000000,,,,0.00094006600556895,
SNATTLPVTQSPR,ph,S,59,true,"atm and atr DNA damage response",88,25561503,"MASCOT Score",60.0000000,0.9470000,,,,,0.1200000
SNATTLPVTQSPR,ph,S,59,true,"Lateral root-induction - NAA vs control",106,23328941,"MASCOT Score",41.0000000,,,,,,
SNATTLPVTQSPR,ph,S,59,true,"Col-0 callus - FC Col-0 vs. Col-0 Xray",111a,31410901,,39.6700000,,-0.6758233,0.0000000,NO,,1.3771752
SNATTLPVTQSPR,ph,S,59,true,"Col-0 X-ray callus - FC Col-0 vs. Col-0 Xray",111b,31410901,,39.6700000,,-0.6758233,0.0000000,NO,,1.3771752
SNATTLPVTQSPR,ph,S,59,true,"atm callus - FC atm vs. atm Xray",111c,31410901,,39.6700000,,-1.2217373,0.0000000,NO,,1.3771752
SNATTLPVTQSPR,ph,S,59,true,"atm-3 X-ray callus - FC atm vs. atm Xray",111d,31410901,,39.6700000,,-1.2217373,0.0000000,NO,,1.3771752
SNATTLPVTQSPRFTEEIK,ph,T,63,true,"Plasmembrane Ph Immune Responses",25,17651370,,,,,,,,
EISVDHGSSNNNGTSYQTLDEK,ph,S,70,true,"Plasmamembrane phosphorylation",20,15308754,,,,,,,,
EISVDHGSSNNNGTSYQTLDEK,ph,S,75,true,"Plasmamembrane phosphorylation",20,15308754,,,,,,,,
EISVDHGSSNNNGTSYQTLDEK,ph,S,75,true,"Tissue atlas Arabidopsis - ProteomicsDB",114,32188942,"MaxQuant score",147.4100000,0.9975220,,,,8.0417897487935E-33,
EISVDHGSSNNNGTSYQTLDEK,ph,S,76,true,"Plasmamembrane phosphorylation",20,15308754,,,,,,,,
EISVDHGSSNNNGTSYQTLDEK,ph,S,76,true,"Tissue atlas Arabidopsis - ProteomicsDB",114,32188942,"MaxQuant score",121.9900000,0.9975220,,,,5.1993600624757E-21,
FVEDIENGDKFSGSLEK,ph,S,101,true,"Phosphorylation Early Elicitor Signaling",23,17317660,,,,,,,,
FVEDIENGDKFSGSLEK,ph,S,101,true,"Tissue atlas Arabidopsis - ProteomicsDB",114,32188942,"MaxQuant score",256.6600000,0.9907850,,,,0,
FVEDIENGDKFSGSLEK,ph,S,103,true,"Large-scale phosphorylation discovery",44,23111157,XCorr,3.1860000,,,,,,
LLGADSNYVSTR,ph,S,313,true,"Tissue atlas Arabidopsis - ProteomicsDB",114,32188942,"MaxQuant score",201.7600000,0.9193370,,,,1.2436499834807E-30,
LLGADSNYVSTR,ph,T,314,true,"TOR Kinase and ABA Receptor",100,29290610,XCorr,3.6533823,0.9895000,,,,6.419999863283E-6,
LLGADSNYVSTR,ph,T,314,true,"Tissue atlas Arabidopsis - ProteomicsDB",114,32188942,"MaxQuant score",236.4200000,0.7965890,,,,0,
