Peptide,PTM,ModifiedAA,ModifiedPosition,PeptideUniqueToGene,ExperimentDesc,ExpID,PubmedID,ScoreType,IdentScore,LocProb,Log2FChange,PQ-val,QuantSig,PEP,MassErrorPPM
MESFLFTSESVNEGHP,nta,M,1,true,"Arabidopsis translation initiation landscape - NTA",167a,35069635,,,,,,,,
SFLFTSESVNE,nt,S,3,true,"N-terminal ChaFRADIC",92,26010716,"MASCOT Score",45.8500000,,,,,6.6070002503693E-5,
SFLFTSE,nt,S,3,true,"N-terminal ChaFRADIC",92,26010716,"MASCOT Score",29.3900000,,,,,0.05646999925375,
LCDQISDAILDACLEQDPESK,so,C,31,false,"S-sulfenylation site detection using YAP1C",110,32714340,,,,,,,,
VACETCTK,ox,C,42,false,"OxiTRAQ Arabidopsis - 5 mM H2O2 versus control",47,24376095,,,,0.2327949,0.2064802,NO,,
VACETCTK,so,C,42,false,"S-sulfenylation site detection using YAP1C",110,32714340,,,,,,,,
VACETCTK,ox,C,45,false,"OxiTRAQ Arabidopsis - 5 mM H2O2 versus control",47,24376095,,,,0.2327949,0.2064802,NO,,
VACETCTK,so,C,45,false,"S-sulfenylation site detection using YAP1C",110,32714340,,,,,,,,
TCREIGFVSADVGLDADNCK,so,C,73,true,"S-sulfenylation site detection using YAP1C",110,32714340,,,,,,,,
EIGFVSADVGLDADNCK,sno,C,90,true,"hot5-4 / wildtype, FAT-switch S-nitrosoproteome",169,37277371,,,,0.7269692,0.0085968,YES,,
EIGFVSADVGLDADNCK,so,C,90,true,"S-sulfenylation site detection using YAP1C",110,32714340,,,,,,,,
QQSPDIAQGVHGHLTKKPEE,nt,Q,98,true,"HUNTER N-terminome: legumain, GluC and trypsin",119,31951383,"MaxQuant score",66.3250000,,,,,,
QQSPDIAQGVHGHLTKKPE,nt,Q,98,false,"HUNTER N-terminome: legumain, GluC and trypsin",119,31951383,"MaxQuant score",129.2500000,,,,,,
SPDIAQGVHGHLTKKPEE,nt,S,100,true,"Arabidopsis translation initiation landscape - NT",167b,35069635,,,,,,,,
VLVNIEQQSPDIAQGVHGHLTK,ph,S,100,false,"TOR Kinase and ABA Receptor",100,29290610,XCorr,3.4716604,0.9991000,,,,0.00088970002252609,
VLVNIEQQSPDIAQGVHGHLTK,ph,S,100,false,"Tissue atlas Arabidopsis - ProteomicsDB",114,32188942,"MaxQuant score",154.6900000,1.0000000,,,,3.9908700004278E-38,
TKKPEEVGAGDQGHMF,nt,T,112,true,"Arabidopsis translation initiation landscape - NT",167b,35069635,,,,,,,,
QGHMFGYATD,nt,Q,123,false,"HUNTER N-terminome: legumain, GluC and trypsin",119,31951383,"MaxQuant score",94.3020000,,,,,,
TKLGAKLTEVR,nt,T,146,false,"Arabidopsis translation initiation landscape - NT",167b,35069635,,,,,,,,
KNGTCPWLRPDGK,so,C,161,true,"S-sulfenylation site detection using YAP1C",110,32714340,,,,,,,,
NGTCPWLRPDGK,so,C,161,true,"Arabidopsis S-sulfenylation chemoproteomics",108,31578252,"pFind PSM Score",0.1723190,,0.9152000,,,,0.9785529
TCPWLRPDGK,so,C,161,false,"S-sulfenylation site detection using YAP1C",110,32714340,,,,,,,,
SGAMVPVRVHTVLISTQHDE,nt,S,180,true,"Arabidopsis translation initiation landscape - NT",167b,35069635,,,,,,,,
TVLISTQHDE,nt,T,190,false,"Arg/N-end rule seed, prt6 vs. Wt",99,29168982,"MASCOT Score",54.0500000,,-0.5186696,0.1607478,NO,0.0010710000060499,-1.5319662
DLKEHVIKPVIPEK,ub,K,211,false,"upl3 mutant / wildtype",168,35926874,"MaxQuant score",77.4200000,1.0000000,0.2448871,0.7671400,NO,6.5008200181182E-5,0.0683500
EHVIKPVIPEKYLDEK,ub,K,222,false,"upl3 mutant / wildtype",168,35926874,"MaxQuant score",75.3160000,0.9960000,-0.6104332,0.0471610,YES,3.9884500438347E-5,-0.4995800
YLDEKTIFHLNPSGR,ac,K,227,false,"Histone deacetylases - apicidin vs control",98a,29061669,"MaxQuant Score",125.5000000,1.0000000,0.3770000,0.0512861,NO,9.7000003515535E-12,
YLDEKTIFHLNPSGR,ac,K,227,false,"Histone deacetylases substrates - hda14 vs WT",98e,29061669,"MaxQuant Score",140.2000000,1.0000000,-0.0450000,0.9289664,NO,1.4999999552573E-35,
YLDEKTIFHLNPSGR,cr,K,227,false,"Open search Plant PTM Viewer 2.0 - Crotonylation",164c,TBA,,,,,,,,
YLDEKTIFHLNPSGR,ub,K,227,false,"upl3 mutant / wildtype",168,35926874,"MaxQuant score",194.5800000,1.0000000,0.8773516,0.3034000,NO,1.6326499343091E-29,-0.6655000
TIFHLNPSGR,ph,S,235,false,"atm and atr DNA damage response",88,25561503,"MASCOT Score",47.0000000,1.0000000,,,,,-0.3400000
TIFHLNPSGR,ph,S,235,false,"Lateral root-induction - NAA vs control",106,23328941,"MASCOT Score",21.0000000,,,,,,
TIFHLNPSGR,ph,S,235,false,"Phospho cell culture sucrose/TOR",109,30833711,,,0.9999870,,,,,
TIFHLNPSGR,ph,S,235,false,"Tissue atlas Arabidopsis - ProteomicsDB",114,32188942,"MaxQuant score",129.0400000,1.0000000,,,,4.5313401642488E-5,
GPHGDAGLTGR,nt,G,242,false,"Arg/N-end rule seed, prt6 vs. Wt",99,29168982,"MASCOT Score",47.6500000,,,,,0.01429000031203,-1.1621444
SGKDPTKVDRSGAY,nt,S,271,false,"Arabidopsis translation initiation landscape - NT",167b,35069635,,,,,,,,
DPTKVDR,ac,K,277,false,"Quantitative Acetylproteomics",101,29440448,,,,,,,,
SGAYIVR,nt,S,281,false,"Arabidopsis translation initiation landscape - NT",167b,35069635,,,,,,,,
QAAKSIVASGLAR,nt,Q,288,true,"HUNTER N-terminome: legumain, GluC and trypsin",119,31951383,"MaxQuant score",51.0920000,,,,,,
QAAKSIVASGLAR,nt,Q,288,true,"Arabidopsis translation initiation landscape - NT",167b,35069635,,,,,,,,
QAAKSIVASGLAR,ac,K,291,true,"Quantitative Acetylproteomics",101,29440448,,,,,,,,
QAAKSIVASGLAR,ub,K,291,true,"Arabidopsis ubiquitination COFRADIC",40,26744219,"MaxQuant Score",66.0040000,1.0000000,,,,0.0020000000949949,-0.1150000
QAAKSIVASGLAR,ub,K,291,true,"upl3 mutant / wildtype",168,35926874,"MaxQuant score",40.9410000,1.0000000,0.6107001,0.4185600,NO,0.027014700695872,0.8684600
IPDKEILEIVK,ub,K,331,true,"upl3 mutant / wildtype",168,35926874,"MaxQuant score",127.0200000,1.0000000,0.1839628,0.7426400,NO,6.6316301854386E-6,2.8192000
KTAAYGHFGRD,nt,K,364,false,"Arabidopsis translation initiation landscape - NT",167b,35069635,,,,,,,,
FLKTAAYGHFGR,ub,K,364,false,"upl3 mutant / wildtype",168,35926874,"MaxQuant score",96.1130000,1.0000000,0.2302030,0.5805600,NO,7.297309639398E-5,-0.0797960
TAAYGHFGRD,nt,T,365,false,"Arabidopsis translation initiation landscape - NT",167b,35069635,,,,,,,,
DDADFTWEVVKPLK,ub,K,384,true,"upl3 mutant / wildtype",168,35926874,"MaxQuant score",95.2640000,1.0000000,-0.6170561,,,3.7360201531556E-5,-1.2838000
DDADFTWEVVKPLKSNKVQA,ub,K,387,true,"upl3 mutant / wildtype",168,35926874,"MaxQuant score",67.4180000,0.9500000,0.8726318,0.0326810,YES,0.00016293600492645,-1.3414000
DDADFTWEVVKPLKSNK,ub,K,387,true,"upl3 mutant / wildtype",168,35926874,"MaxQuant score",159.3400000,1.0000000,0.2387869,0.7079200,NO,2.103690035184E-17,-1.0569000
DDADFTWEVVKPLKSNKVQA,ub,K,390,true,"upl3 mutant / wildtype",168,35926874,"MaxQuant score",67.4180000,0.9800000,0.8726318,0.0326810,YES,0.00016293600492645,-1.3414000
