Peptide,PTM,ModifiedAA,ModifiedPosition,PeptideUniqueToGene,ExperimentDesc,ExpID,PubmedID,ScoreType,IdentScore,LocProb,Log2FChange,PQ-val,QuantSig,PEP,MassErrorPPM
MEEAKGPVKHVLLASFKD,nta,M,1,true,"HUNTER N-terminome: legumain, GluC and trypsin",119,31951383,"MaxQuant score",85.8080000,,,,,,
MEEAKGPVKHVLLASFK,nta,M,1,true,"Arabidopsis translation initiation landscape - NTA",167a,35069635,,,,,,,,
MEEAKGPVKH,nta,M,1,true,"Arg/N-end rule seed, prt6 vs. Wt",99,29168982,"MASCOT Score",36.3800000,,-0.2354344,0.0334873,NO,0.0023459999356419,-0.2232738
EAKGPVKHVLLASFK,nt,E,3,true,"Arabidopsis translation initiation landscape - NT",167b,35069635,,,,,,,,
AKGPVKHVLLASFKDGVSPE,nt,A,4,true,"Arabidopsis translation initiation landscape - NT",167b,35069635,,,,,,,,
MEEAKGPVK,ub,K,5,true,"upl3 mutant / wildtype",168,35926874,"MaxQuant score",74.9200000,1.0000000,-0.1504010,0.7758400,NO,0.0027688499540091,-1.6659000
NLHQGYTHIFE,nt,N,55,true,"Arabidopsis translation initiation landscape - NT",167b,35069635,,,,,,,,
YIAHPAHVE,nt,Y,77,true,"Arabidopsis translation initiation landscape - NT",167b,35069635,,,,,,,,
VLVIDYKPTSVSL,ph,S,108,true,"TOR Kinase and ABA Receptor",100,29290610,XCorr,4.3271322,1.0000000,,,,3.6189999264025E-7,
VLVIDYKPTSVSL,ph,S,108,true,"Phospho cell culture sucrose/TOR",109,30833711,,,0.9329010,,,,,
VLVIDYKPTSVSL,ph,S,108,true,"Tissue atlas Arabidopsis - ProteomicsDB",114,32188942,"MaxQuant score",140.4500000,0.9991740,,,,2.244220013381E-5,
