Peptide,PTM,ModifiedAA,ModifiedPosition,PeptideUniqueToGene,ExperimentDesc,ExpID,PubmedID,ScoreType,IdentScore,LocProb,Log2FChange,PQ-val,QuantSig,PEP,MassErrorPPM
THVEDDKEFKEKPL,nta,T,2,true,"Arabidopsis translation initiation landscape - NTA",167a,35069635,,,,,,,,
EKPLVQVLSDDDSEVKEAK,ph,S,20,true,"Arabidopsis root NAA phosphoproteome",18a,27643528,"MaxQuant Score",176.1400000,1.0000000,,,,2.9670000274642E-30,-0.2640000
EKPLVQVLSDDDSEVKEAK,ph,S,20,true,"STN8 phosphoproteome",38,21768351,"MASCOT Score",74.6300000,,,,,,
EKPLVQVLSDDDSEVKEAK,ph,S,20,true,"PAMP-triggered phosphorylation",48,24601666,"MASCOT Score",24.8200000,,,,,,
EKPLVQVLSDDDSEVKEAK,ph,S,20,true,"Chloroplast kinase substrates",60,19376835,"MASCOT Score",72.4400000,,,,,,-0.7092460
EKPLVQVLSDDDSEVKEAK,ph,S,20,true,"LAXIC - ABA stress",84a,23660473,XCorr,2.6200000,1.0000000,,,,0.018011199310422,
EKPLVQVLSDDDSEVKEAK,ph,S,20,true,"LAXIC - mannitol vs control",84b,23660473,XCorr,3.1000000,1.0000000,1.5665795,,NO,0.00070679397322237,
EKPLVQVLSDDDSEVKEAK,ph,S,20,true,"SnRK2 protein kinase substrates",85,23776212,XCorr,3.6912901,1.0000000,,,,5.0196201362152E-12,
EKPLVQVLSDDDSEVKEAK,ph,S,20,true,"Brassinosteroid-Regulated Phosphorylation Dynamics",94,26187819,"MaxQuant Score",218.8800000,1.0000000,,,,0,1.1780000
EKPLVQVLSDDDSEVKEAK,ph,S,20,true,"Phospho cell culture sucrose/TOR",109,30833711,,,1.0000000,,,,,
EKPLVQVLSDDDSEVKEAK,ph,S,20,true,"Col-0 callus - FC Col-0 vs. Col-0 Xray",111a,31410901,,40.6500000,,-0.2811772,0.0000000,NO,,0.8003455
EKPLVQVLSDDDSEVKEAK,ph,S,20,true,"Col-0 X-ray callus - FC Col-0 vs. Col-0 Xray",111b,31410901,,40.6500000,,-0.2811772,0.0000000,NO,,0.8003455
EKPLVQVLSDDDSEVKEAK,ph,S,20,true,"atm callus - FC atm vs. atm Xray",111c,31410901,,40.6500000,,-0.7438790,0.0000000,NO,,0.8003455
EKPLVQVLSDDDSEVKEAK,ph,S,20,true,"atm-3 X-ray callus - FC atm vs. atm Xray",111d,31410901,,40.6500000,,-0.7438790,0.0000000,NO,,0.8003455
EKPLVQVLSDDDSEVKEAK,ph,S,20,true,"Touch-induced phosphorylation: 40s touch vs untouc",136,30291188,"MASCOT score",66.0300000,,-0.0352332,0.3760113,NO,,-4.1977825
PLVQVLSDDDSEVKEAK,ph,S,20,true,"Tissue atlas Arabidopsis - ProteomicsDB",114,32188942,"MaxQuant score",401.4900000,1.0000000,,,,0,
EKPLVQVLSDDDSEVK,ph,S,20,true,"STN8 phosphoproteome",38,21768351,"MASCOT Score",92.8400000,,,,,,-1.0427700
EKPLVQVLSDDDSEVK,ph,S,20,true,"Phosphoproteome iron-deficient Arabidopsis roots",41,22438062,"MASCOT Score",46.6800000,,,,,,
EKPLVQVLSDDDSEVK,ph,S,20,true,"Tyrosine phosphorylation in Arabidopsis",59,18463617,"MASCOT Score",71.0000000,,,,,,-1.1702879
EKPLVQVLSDDDSEVK,ph,S,20,true,"Chloroplast kinase substrates",60,19376835,"MASCOT Score",44.0800000,,,,,,-0.1925620
EKPLVQVLSDDDSEVK,ph,S,20,true,"srk2dei ABA signaling phopshoproteomics",83,23572148,"MASCOT Score",62.0000000,,,,,,-0.0004000
EKPLVQVLSDDDSEVK,ph,S,20,true,"LAXIC - ABA stress",84a,23660473,XCorr,4.1700000,1.0000000,,,,0.011404500342906,
EKPLVQVLSDDDSEVK,ph,S,20,true,"LAXIC - mannitol vs control",84b,23660473,XCorr,4.3600000,1.0000000,,,,2.7600000410133E-11,
EKPLVQVLSDDDSEVK,ph,S,20,true,"SnRK2 protein kinase substrates",85,23776212,XCorr,4.1858754,1.0000000,,,,0.00025872798869386,
EKPLVQVLSDDDSEVK,ph,S,20,true,"atm and atr DNA damage response",88,25561503,"MASCOT Score",67.0000000,1.0000000,,,,,-0.7900000
EKPLVQVLSDDDSEVK,ph,S,20,true,"TOR Kinase and ABA Receptor",100,29290610,XCorr,3.8218312,1.0000000,,,,0.00066289998358116,
EKPLVQVLSDDDSEVK,ph,S,20,true,"Lateral root-induction - NAA vs control",106,23328941,"MASCOT Score",50.0000000,,,,,,
EKPLVQVLSDDDSEVK,ph,S,20,true,"Touch-induced phosphorylation: 40s touch vs untouc",136,30291188,"MASCOT score",88.0000000,,-0.0880668,0.6360770,NO,,1.2743829
EKPLVQVLSDDDSEVKEAK,ph,S,24,true,"Arabidopsis root NAA phosphoproteome",18a,27643528,"MaxQuant Score",176.1400000,1.0000000,,,,2.9670000274642E-30,-0.2640000
EKPLVQVLSDDDSEVKEAK,ph,S,24,true,"PAMP-triggered phosphorylation",48,24601666,"MASCOT Score",24.8200000,,,,,,
EKPLVQVLSDDDSEVKEAK,ph,S,24,true,"Chloroplast kinase substrates",60,19376835,"MASCOT Score",72.4400000,,,,,,-0.7092460
EKPLVQVLSDDDSEVKEAK,ph,S,24,true,"LAXIC - ABA stress",84a,23660473,XCorr,2.6200000,1.0000000,,,,0.018011199310422,
EKPLVQVLSDDDSEVKEAK,ph,S,24,true,"LAXIC - mannitol vs control",84b,23660473,XCorr,3.1000000,1.0000000,1.5665795,,NO,0.00070679397322237,
EKPLVQVLSDDDSEVKEAK,ph,S,24,true,"SnRK2 protein kinase substrates",85,23776212,XCorr,4.3145957,0.9990000,,,,0.00056921201758087,
EKPLVQVLSDDDSEVKEAK,ph,S,24,true,"Brassinosteroid-Regulated Phosphorylation Dynamics",94,26187819,"MaxQuant Score",218.8800000,1.0000000,,,,0,1.1780000
EKPLVQVLSDDDSEVKEAK,ph,S,24,true,"Col-0 callus - FC Col-0 vs. Col-0 Xray",111a,31410901,,40.6500000,,-0.2811772,0.0000000,NO,,0.8003455
EKPLVQVLSDDDSEVKEAK,ph,S,24,true,"Col-0 X-ray callus - FC Col-0 vs. Col-0 Xray",111b,31410901,,40.6500000,,-0.2811772,0.0000000,NO,,0.8003455
EKPLVQVLSDDDSEVKEAK,ph,S,24,true,"atm callus - FC atm vs. atm Xray",111c,31410901,,40.6500000,,-0.7438790,0.0000000,NO,,0.8003455
EKPLVQVLSDDDSEVKEAK,ph,S,24,true,"atm-3 X-ray callus - FC atm vs. atm Xray",111d,31410901,,40.6500000,,-0.7438790,0.0000000,NO,,0.8003455
EKPLVQVLSDDDSEVKEAK,ph,S,24,true,"Touch-induced phosphorylation: 40s touch vs untouc",136,30291188,"MASCOT score",66.0300000,,-0.0352332,0.3760113,NO,,-4.1977825
PLVQVLSDDDSEVKEAK,ph,S,24,true,"Tissue atlas Arabidopsis - ProteomicsDB",114,32188942,"MaxQuant score",401.4900000,1.0000000,,,,0,
EKPLVQVLSDDDSEVK,ph,S,24,true,"Phosphoproteome iron-deficient Arabidopsis roots",41,22438062,"MASCOT Score",46.6800000,,,,,,
EKPLVQVLSDDDSEVK,ph,S,24,true,"Tyrosine phosphorylation in Arabidopsis",59,18463617,"MASCOT Score",41.0000000,,,,,,-0.5319487
EKPLVQVLSDDDSEVK,ph,S,24,true,"srk2dei ABA signaling phopshoproteomics",83,23572148,"MASCOT Score",53.0000000,,,,,,-0.0009000
EKPLVQVLSDDDSEVK,ph,S,24,true,"LAXIC - ABA stress",84a,23660473,XCorr,2.1300000,1.0000000,,,,0.19033999741077,
EKPLVQVLSDDDSEVK,ph,S,24,true,"LAXIC - mannitol vs control",84b,23660473,XCorr,3.9300000,1.0000000,,,,2.5900000764523E-5,
EKPLVQVLSDDDSEVK,ph,S,24,true,"SnRK2 protein kinase substrates",85,23776212,XCorr,2.6720753,1.0000000,,,,3.6643300518335E-6,
EKPLVQVLSDDDSEVK,ph,S,24,true,"TOR Kinase and ABA Receptor",100,29290610,XCorr,3.8218312,1.0000000,,,,0.00066289998358116,
EKPLVQVLSDDDSEVK,ph,S,24,true,"Lateral root-induction - NAA vs control",106,23328941,"MASCOT Score",50.0000000,,,,,,
VAKDHSEQGDVTGDNIR,ub,K,147,true,"Arabidopsis ubiquitination COFRADIC",40,26744219,"MaxQuant Score",193.1900000,1.0000000,,,,0,0.1270000
DHSEQGDVTGDNIRPSK,ph,S,150,true,"TOR Kinase and ABA Receptor",100,29290610,XCorr,4.3355370,1.0000000,,,,1.063000013346E-6,
DHSEQGDVTGDNIRPSK,ph,S,150,true,"Tissue atlas Arabidopsis - ProteomicsDB",114,32188942,"MaxQuant score",146.4500000,1.0000000,,,,7.3763602647867E-13,
VAKDHSEQGDVTGDNIRPSKR,ub,K,164,true,"Arabidopsis ubiquitination COFRADIC",40,26744219,"MaxQuant Score",115.4200000,1.0000000,,,,3.1670000387151E-24,0.4070000
