Peptide,PTM,ModifiedAA,ModifiedPosition,PeptideUniqueToGene,ExperimentDesc,ExpID,PubmedID,ScoreType,IdentScore,LocProb,Log2FChange,PQ-val,QuantSig,PEP,MassErrorPPM
YLSGFTKVDDNR,ac,K,62,false,"Quantitative Acetylproteomics",101,29440448,,,,,,,,
ENEQLSKYGDTK,ac,K,132,false,"Quantitative Acetylproteomics",101,29440448,,,,,,,,
ENEQLSKYGDTK,ub,K,132,false,"upl3 mutant / wildtype",168,35926874,"MaxQuant score",199.4000000,1.0000000,0.5360529,0.5578000,NO,4.3416898827367E-18,-0.4353500
LAFPSFKASR,ub,K,167,true,"upl3 mutant / wildtype",168,35926874,"MaxQuant score",85.9630000,1.0000000,-0.2159149,0.7822200,NO,0.0029614199884236,0.2218800
TLFLDHSCSPSNGAR,sno,C,204,true,"Site-specific nitrosomeproteomic id - gsnor1-3",90a,25699590,XCorr,2.1089313,,,,,0.00059210002655163,-1.9473400
TLFLDHSCSPSNGAR,ph,S,205,true,"atm and atr DNA damage response",88,25561503,"MASCOT Score",47.0000000,1.0000000,,,,,-0.5700000
TLFLDHSCSPSNGAR,ph,S,205,true,"Tissue atlas Arabidopsis - ProteomicsDB",114,32188942,"MaxQuant score",179.7100000,0.9979940,,,,5.3931698519838E-25,
ALTPVNLPVAAVAR,ph,T,214,true,"Arabidopsis root NAA phosphoproteome",18a,27643528,"MaxQuant Score",67.4150000,1.0000000,,,,2.3840000721975E-5,-2.1190000
ALTPVNLPVAAVAR,ph,T,214,true,"atm and atr DNA damage response",88,25561503,"MASCOT Score",53.0000000,1.0000000,,,,,-0.3400000
ALTPVNLPVAAVAR,ph,T,214,true,"Phospho cell culture sucrose/TOR",109,30833711,,,1.0000000,,,,,
ALTPVNLPVAAVAR,ph,T,214,true,"Tissue atlas Arabidopsis - ProteomicsDB",114,32188942,"MaxQuant score",206.6600000,1.0000000,,,,9.6535451207337E-42,
APSNSLGLMDYQSADHEQLMK,ph,S,292,true,"Lateral root-induction - NAA vs control",106,23328941,"MASCOT Score",22.0000000,,,,,,
APSNSLGLMDYQSADHEQLMK,ph,S,292,true,"Tissue atlas Arabidopsis - ProteomicsDB",114,32188942,"MaxQuant score",137.4200000,0.9599720,,,,6.9545100190958E-23,
APSNSLGLMDYQSADHEQLMK,ph,S,294,true,"TOR Kinase and ABA Receptor",100,29290610,XCorr,4.6146407,0.9073000,,,,6.7730002228927E-7,
APSNSLGLMDYQSADHEQLMK,ph,S,294,true,"Phospho cell culture sucrose/TOR",109,30833711,,,0.9558870,,,,,
APSNSLGLMDYQSADHEQLMK,ph,S,294,true,"Tissue atlas Arabidopsis - ProteomicsDB",114,32188942,"MaxQuant score",299.9400000,1.0000000,,,,0,
SAQTSNEVTYPAHSHPPASLDDLPR,ph,T,317,true,"Tissue atlas Arabidopsis - ProteomicsDB",114,32188942,"MaxQuant score",153.2500000,0.7899480,,,,1.1210387714599E-44,
SAQTSNEVTYPAHSHPPASLDDLPR,ph,S,318,true,"Tissue atlas Arabidopsis - ProteomicsDB",114,32188942,"MaxQuant score",191.1100000,0.9878200,,,,0,
SAQTSNEVTYPAHSHPPASLDDLPR,ph,S,327,true,"Tissue atlas Arabidopsis - ProteomicsDB",114,32188942,"MaxQuant score",103.8500000,0.9005940,,,,2.6624599688226E-17,
NVVSTIR,ph,S,342,true,"Lateral root-induction - NAA vs control",106,23328941,"MASCOT Score",25.0000000,,,,,,
LFSCGTSK,so,C,558,false,"S-sulfenylation site detection using YAP1C",110,32714340,,,,,,,,
VSTSAMASSISPAIGK,og,S,687,true,"O-GlcNac Inflorescence Tissue",81,28154133,"MASCOT Score",44.6000000,,,,,,0.6100000
VSTSAMASSISPAIGK,og,T,688,true,"O-GlcNac Inflorescence Tissue",81,28154133,"MASCOT Score",44.6000000,,,,,,0.6100000
VSTSAMASSISPAIGK,og,S,689,true,"O-GlcNac Inflorescence Tissue",81,28154133,"MASCOT Score",37.8000000,,,,,,1.8000000
VSTSAMASSISPAIGK,ph,S,689,true,"Tissue atlas Arabidopsis - ProteomicsDB",114,32188942,"MaxQuant score",122.5800000,0.8630200,,,,3.7699599886309E-8,
VSTSAMASSISPAIGK,ph,S,694,true,"Tissue atlas Arabidopsis - ProteomicsDB",114,32188942,"MaxQuant score",187.3500000,0.8110510,,,,1.4466699814462E-27,
VSTSAMASSISPAIGK,ph,S,696,true,"Tissue atlas Arabidopsis - ProteomicsDB",114,32188942,"MaxQuant score",260.5600000,0.9937920,,,,0,
IEHMDAGSPARPTPIPNGIEAMSR,ph,S,709,true,"Arabidopsis root NAA phosphoproteome",18a,27643528,"MaxQuant Score",44.3410000,0.9710000,,,,0.00066080002579838,0.7090000
IEHMDAGSPARPTPIPNGIEAMSR,ph,S,709,true,"PAMP-triggered phosphorylation",48,24601666,"MASCOT Score",36.1100000,,,,,,
IEHMDAGSPARPTPIPNGIEAMSR,ph,S,709,true,"SnRK2 protein kinase substrates",85,23776212,XCorr,2.2891181,1.0000000,,,,0.0061206701211631,
IEHMDAGSPARPTPIPNGIEAMSR,ph,S,709,true,"atm and atr DNA damage response",88,25561503,"MASCOT Score",36.0000000,1.0000000,,,,,0.3100000
IEHMDAGSPARPTPIPNGIEAMSR,ph,S,709,true,"TOR Kinase and ABA Receptor",100,29290610,XCorr,4.8294287,0.9996000,,,,6.7979999585077E-5,
IEHMDAGSPARPTPIPNGIEAMSR,ph,S,709,true,"Lateral root-induction - NAA vs control",106,23328941,"MASCOT Score",26.0000000,,,,,,
IEHMDAGSPARPTPIPNGIEAMSR,ph,S,709,true,"Phospho cell culture sucrose/TOR",109,30833711,,,0.9998250,,,,,
IEHMDAGSPARPTPIPNGIEAMSR,ph,S,709,true,"Tissue atlas Arabidopsis - ProteomicsDB",114,32188942,"MaxQuant score",219.6700000,0.9999990,,,,0,
NLDSVDKSKPLELTEIVDPTQCR,nt,N,732,true,"Metacaspase9 substrates - in vitro rMC9",51c,23964026,"MASCOT Score",52.0000000,,,,,,-0.4186342
SKPLELTEIVDPTQCR,so,C,753,true,"Arabidopsis S-sulfenylation chemoproteomics",108,31578252,"pFind PSM Score",0.0017462,,1.1418000,,,,-0.9292075
WGVGVAAGSDK,ph,S,1105,true,"Tyrosine phosphorylation in Arabidopsis",59,18463617,"MASCOT Score",60.0000000,,,,,,-0.6219542
WGVGVAAGSDK,ph,S,1105,true,"Conserved plant phosphoproteome - Arabidopsis",61a,20466843,"MASCOT Score",69.0000000,1.0000000,,,,,
WGVGVAAGSDK,ph,S,1105,true,"TOR Kinase and ABA Receptor",100,29290610,XCorr,2.8313849,1.0000000,,,,0.00047020000056364,
WGVGVAAGSDK,ph,S,1105,true,"Tissue atlas Arabidopsis - ProteomicsDB",114,32188942,"MaxQuant score",101.3600000,1.0000000,,,,6.8004899299929E-29,
AGTENGRPSSSSAANNSSSDQIQR,ph,S,1116,true,"atm and atr DNA damage response",88,25561503,"MASCOT Score",34.0000000,0.9040000,,,,,-0.8500000
AGTENGRPSSSSAANNSSSDQIQR,ph,S,1116,true,"Lateral root-induction - NAA vs control",106,23328941,"MASCOT Score",34.0000000,,,,,,
AGTENGRPSSSSAANNSSSDQIQR,fuc,S,1117,true,"SPINDLY O-fucosylation",162,36739885,,,,,,,0.021999999880791,
AGTENGRPSSSSAANNSSSDQIQR,ph,S,1117,true,"atm and atr DNA damage response",88,25561503,"MASCOT Score",55.0000000,0.9040000,,,,,0.8400000
AGTENGRPSSSSAANNSSSDQIQR,ph,S,1117,true,"Tissue atlas Arabidopsis - ProteomicsDB",114,32188942,"MaxQuant score",296.7100000,0.9577690,,,,0,
AGTENGRPSSSSAANNSSSDQIQR,ph,S,1118,true,"Lateral root-induction - NAA vs control",106,23328941,"MASCOT Score",25.0000000,,,,,,
AGTENGRPSSSSAANNSSSDQIQR,ph,S,1118,true,"Tissue atlas Arabidopsis - ProteomicsDB",114,32188942,"MaxQuant score",295.7500000,0.7740020,,,,0,
AGTENGRPSSSSAANNSSSDQIQR,ph,S,1119,true,"srk2dei ABA signaling phopshoproteomics",83,23572148,"MASCOT Score",50.0000000,,,,,,-0.0024000
AGTENGRPSSSSAANNSSSDQIQR,ph,S,1119,true,"Tissue atlas Arabidopsis - ProteomicsDB",114,32188942,"MaxQuant score",305.8100000,0.7564680,,,,0,
AGTENGRPSSSSAANNSSSDQIQR,ph,S,1124,true,"atm and atr DNA damage response",88,25561503,"MASCOT Score",59.0000000,0.9250000,,,,,-0.2700000
AGTENGRPSSSSAANNSSSDQIQR,ph,S,1124,true,"Lateral root-induction - NAA vs control",106,23328941,"MASCOT Score",32.0000000,,,,,,
AGTENGRPSSSSAANNSSSDQIQR,ph,S,1124,true,"Tissue atlas Arabidopsis - ProteomicsDB",114,32188942,"MaxQuant score",287.1700000,0.9978650,,,,0,
AGTENGRPSSSSAANNSSSDQIQR,ph,S,1125,true,"SnRK2 protein kinase substrates",85,23776212,XCorr,4.8754468,0.7760000,,,,2.3027400434606E-14,
AGTENGRPSSSSAANNSSSDQIQR,ph,S,1125,true,"Lateral root-induction - NAA vs control",106,23328941,"MASCOT Score",41.0000000,,,,,,
AGTENGRPSSSSAANNSSSDQIQR,ph,S,1125,true,"Tissue atlas Arabidopsis - ProteomicsDB",114,32188942,"MaxQuant score",246.4600000,0.8065680,,,,0,
AGTENGRPSSSSAANNSSSDQIQR,ph,S,1126,true,"atm and atr DNA damage response",88,25561503,"MASCOT Score",34.0000000,0.9810000,,,,,-0.8500000
AGTENGRPSSSSAANNSSSDQIQR,ph,S,1126,true,"Tissue atlas Arabidopsis - ProteomicsDB",114,32188942,"MaxQuant score",239.8700000,0.9259920,,,,0,
