Peptide,PTM,ModifiedAA,ModifiedPosition,PeptideUniqueToGene,ExperimentDesc,ExpID,PubmedID,ScoreType,IdentScore,LocProb,Log2FChange,PQ-val,QuantSig,PEP,MassErrorPPM
ASEQLMSPASGGGR,nta,A,2,true,"Characterization plant N-terminal acetylation",6,22223895,"MASCOT Score",43.6500000,,,,,,
ASEQLMSPASGGGR,nta,A,2,true,"Arabidopsis translation initiation landscape - NTA",167a,35069635,,,,,,,,
KEEDSIRGIR,ph,S,622,true,"Tissue atlas Arabidopsis - ProteomicsDB",114,32188942,"MaxQuant score",68.4630000,1.0000000,,,,0.0024277199991047,
RDDSFSSR,ph,S,631,true,"atm and atr DNA damage response",88,25561503,"MASCOT Score",47.0000000,1.0000000,,,,,-0.4700000
RDDSFSSR,ph,S,631,true,"Tissue atlas Arabidopsis - ProteomicsDB",114,32188942,"MaxQuant score",131.4200000,0.9989040,,,,0.0021924199536443,
SSLQDIPLLLPHEPVDQDGSSGGHKENGTNNR,ph,S,655,true,"Tissue atlas Arabidopsis - ProteomicsDB",114,32188942,"MaxQuant score",142.4600000,0.7773170,,,,0,
NGPFSFRK,ph,S,672,true,"atm and atr DNA damage response",88,25561503,"MASCOT Score",20.0000000,1.0000000,,,,,-2.0900000
NGPFSFRK,ph,S,672,true,"Tissue atlas Arabidopsis - ProteomicsDB",114,32188942,"MaxQuant score",88.4950000,1.0000000,,,,0.0092361997812986,
SKIEPVDGDTPMR,ph,S,676,true,"atm and atr DNA damage response",88,25561503,"MASCOT Score",29.0000000,1.0000000,,,,,-1.5000000
SKIEPVDGDTPMR,ph,S,676,true,"Tissue atlas Arabidopsis - ProteomicsDB",114,32188942,"MaxQuant score",110.5700000,1.0000000,,,,0.00020755900186487,
SKIEPVDGDTPMR,ph,T,685,true,"Tissue atlas Arabidopsis - ProteomicsDB",114,32188942,"MaxQuant score",133.4800000,1.0000000,,,,0.00012164899817435,
RGSNAIDSEWWETQDHDYQVGSPDETGQVGPR,ph,S,706,true,"Tissue atlas Arabidopsis - ProteomicsDB",114,32188942,"MaxQuant score",167.8200000,0.9999970,,,,0,
