Peptide,PTM,ModifiedAA,ModifiedPosition,PeptideUniqueToGene,ExperimentDesc,ExpID,PubmedID,ScoreType,IdentScore,LocProb,Log2FChange,PQ-val,QuantSig,PEP,MassErrorPPM
WLQSAGLQHLASPVASTGNDQR,ph,S,45,true,"TOR Kinase and ABA Receptor",100,29290610,XCorr,4.7363200,0.9987000,,,,3.5860001190713E-8,
WLQSAGLQHLASPVASTGNDQR,ph,S,45,true,"Tissue atlas Arabidopsis - ProteomicsDB",114,32188942,"MaxQuant score",282.2100000,1.0000000,,,,0,
VVEKDSNSSTSGIDFR,ph,S,579,true,"Tissue atlas Arabidopsis - ProteomicsDB",114,32188942,"MaxQuant score",95.9540000,0.9892640,,,,1.8964899936691E-5,
DSNSSTSGIDFR,ph,S,581,true,"Tissue atlas Arabidopsis - ProteomicsDB",114,32188942,"MaxQuant score",110.5100000,0.9957690,,,,6.4863001171034E-5,
DSNSSTSGIDFR,ph,S,582,true,"Tissue atlas Arabidopsis - ProteomicsDB",114,32188942,"MaxQuant score",124.4700000,0.9600030,,,,3.5499899240676E-5,
EESGIPSFSMDK,ph,S,598,true,"Tissue atlas Arabidopsis - ProteomicsDB",114,32188942,"MaxQuant score",54.8230000,0.9998110,,,,0.00077728601172566,
EESGIPSFSMDK,ph,S,604,true,"Tissue atlas Arabidopsis - ProteomicsDB",114,32188942,"MaxQuant score",122.9700000,0.9906130,,,,3.4624699765118E-5,
SEPNSSFAGSTSQR,ph,S,614,true,"Tissue atlas Arabidopsis - ProteomicsDB",114,32188942,"MaxQuant score",77.0680000,0.8528670,,,,0.00061955297132954,
SEPNSSFAGSTSQR,ph,S,621,true,"Tissue atlas Arabidopsis - ProteomicsDB",114,32188942,"MaxQuant score",133.1600000,0.7603030,,,,5.4360299373002E-8,
NNISSYPQETSDREEK,ph,T,633,true,"Tissue atlas Arabidopsis - ProteomicsDB",114,32188942,"MaxQuant score",109.0300000,0.8234530,,,,5.5826401279546E-8,
NNISSYPQETSDREEK,ph,S,634,true,"atm and atr DNA damage response",88,25561503,"MASCOT Score",42.0000000,0.9460000,,,,,-0.2800000
NNISSYPQETSDREEK,ph,S,634,true,"TOR Kinase and ABA Receptor",100,29290610,XCorr,4.1008520,0.8907000,,,,0.00040099999750964,
NNISSYPQETSDREEK,ph,S,634,true,"Tissue atlas Arabidopsis - ProteomicsDB",114,32188942,"MaxQuant score",260.9600000,0.9925670,,,,0,
DVSSSDIPTLTNFR,ph,S,668,true,"Tissue atlas Arabidopsis - ProteomicsDB",114,32188942,"MaxQuant score",179.4600000,0.9997410,,,,1.3568999531025E-22,
