Peptide,PTM,ModifiedAA,ModifiedPosition,PeptideUniqueToGene,ExperimentDesc,ExpID,PubmedID,ScoreType,IdentScore,LocProb,Log2FChange,PQ-val,QuantSig,PEP,MassErrorPPM
GDGAEIVTR,nt,G,2,true,"Arg/N-end rule seed, prt6 vs. Wt",99,29168982,"MASCOT Score",59.8200000,,,,,0.052629999816418,-2.6828487
GDGAEIVTR,nta,G,2,true,"Arg/N-end rule seed, prt6 vs. Wt",99,29168982,"MASCOT Score",59.8200000,,,,,0.052629999816418,-2.6828487
LYGDEKKLAEDGR,ub,K,16,true,"Arabidopsis ubiquitination COFRADIC",40,26744219,"MaxQuant Score",100.1100000,0.8110000,,,,9.3329999284464E-10,1.1940000
MASSLDVVENSEK,ph,S,142,true,"Tissue atlas Arabidopsis - ProteomicsDB",114,32188942,"MaxQuant score",167.8900000,0.9965770,,,,6.2368001523894E-15,
TGAEFNSVK,ph,S,235,true,"Tissue atlas Arabidopsis - ProteomicsDB",114,32188942,"MaxQuant score",122.8600000,1.0000000,,,,0.00024372100597247,
SLNDSIEVAAGTLSPLEK,ph,S,257,true,"Large-scale phosphorylation discovery",44,23111157,XCorr,4.5230000,,,,,,
SLNDSIEVAAGTLSPLEK,ph,S,257,true,"SnRK2 protein kinase substrates",85,23776212,XCorr,3.1852229,1.0000000,,,,0.005599960219115,
SLNDSIEVAAGTLSPLEK,ph,S,257,true,"Tissue atlas Arabidopsis - ProteomicsDB",114,32188942,"MaxQuant score",299.1600000,0.9991100,,,,0,
SLNDSIEVAAGTLSPLEK,ph,S,257,true,"Touch-induced phosphorylation: 40s touch vs untouc",136,30291188,"MASCOT score",88.4600000,,0.0664677,0.8115493,NO,,4.7825729
ESEVLSSVSPTESR,ph,S,318,true,"Tyrosine phosphorylation in Arabidopsis",59,18463617,"MASCOT Score",65.0000000,,,,,,-0.0630641
ESEVLSSVSPTESR,ph,S,318,true,"atm and atr DNA damage response",88,25561503,"MASCOT Score",87.0000000,0.9980000,,,,,-0.7700000
ESEVLSSVSPTESR,ph,S,318,true,"TOR Kinase and ABA Receptor",100,29290610,XCorr,4.1623554,0.9894000,,,,2.8320000637905E-5,
ESEVLSSVSPTESR,ph,S,318,true,"Lateral root-induction - NAA vs control",106,23328941,"MASCOT Score",43.0000000,,,,,,
ESEVLSSVSPTESR,ph,S,318,true,"Phospho cell culture sucrose/TOR",109,30833711,,,0.7875760,,,,,
ESEVLSSVSPTESR,ph,S,318,true,"Tissue atlas Arabidopsis - ProteomicsDB",114,32188942,"MaxQuant score",222.1600000,0.9337870,,,,0,
ESEVLSSVSPTESR,ph,T,320,true,"Tyrosine phosphorylation in Arabidopsis",59,18463617,"MASCOT Score",56.0000000,,,,,,-0.5045134
VGAFSFDR,ph,S,434,false,"atm and atr DNA damage response",88,25561503,"MASCOT Score",35.0000000,1.0000000,,,,,-0.7700000
VGAFSFDR,ph,S,434,false,"Tissue atlas Arabidopsis - ProteomicsDB",114,32188942,"MaxQuant score",84.6580000,1.0000000,,,,0.0078244702890515,
