Peptide,PTM,ModifiedAA,ModifiedPosition,PeptideUniqueToGene,ExperimentDesc,ExpID,PubmedID,ScoreType,IdentScore,LocProb,Log2FChange,PQ-val,QuantSig,PEP,MassErrorPPM
AQKVEAQGGKGANLWDDGSTH,nt,A,2,true,"Arg/N-end rule seed, prt6 vs. Wt",99,29168982,"MASCOT Score",34.9200000,,,,,0.00048230000538751,-2.3427058
AQKVEAQGGKGAN,nt,A,2,true,"Arg/N-end rule seed, prt6 vs. Wt",99,29168982,"MASCOT Score",57.4700000,,,,,0.00013669999316335,-0.5716063
AQKVEAQGGKGA,nt,A,2,true,"Arg/N-end rule seed, prt6 vs. Wt",99,29168982,"MASCOT Score",35.6300000,,,,,0.00037160000647418,0.1077132
AQKVEAQGGKGANLWDDGSTHDAVTKIQLAAGIDGIQY,nta,A,2,true,"Arg/N-end rule pathway Roots",80,25728785,"MASCOT Score",27.1900000,,,,,0.00048950000200421,
AQKVEAQGGKGANLWDDGSTHDAVTKIQLAA,nta,A,2,true,"Arg/N-end rule pathway Roots",80,25728785,"MASCOT Score",22.3000000,,,,,0.0030559999868274,
AQKVEAQGGKGANLWDDGSTHDAVTKIQL,nta,A,2,true,"Arg/N-end rule pathway Roots",80,25728785,"MASCOT Score",49.4700000,,,,,0.00034239998785779,
AQKVEAQGGKGANLWDDGSTHDAVTK,nta,A,2,true,"Arg/N-end rule pathway Roots",80,25728785,"MASCOT Score",49.5800000,,,,,1.094999970519E-5,
AQKVEAQGGKGANLWDDGSTH,nta,A,2,true,"Arg/N-end rule pathway Roots",80,25728785,"MASCOT Score",39.0000000,,,,,4.9930000386667E-5,
AQKVEAQGGKGANLWDDGSTH,nta,A,2,true,"Arg/N-end rule seed, prt6 vs. Wt",99,29168982,"MASCOT Score",34.9200000,,-0.0800310,0.4194530,NO,0.00048230000538751,-2.3427058
AQKVEAQGGKGAN,nta,A,2,true,"Arg/N-end rule seed, prt6 vs. Wt",99,29168982,"MASCOT Score",57.4700000,,-0.1962633,0.0172200,NO,0.00013669999316335,-0.5716063
AQKVEAQGGKGA,nta,A,2,true,"Arg/N-end rule pathway Roots",80,25728785,"MASCOT Score",30.9800000,,,,,0.090000003576279,
AQKVEAQGGKGA,nta,A,2,true,"Arg/N-end rule seed, prt6 vs. Wt",99,29168982,"MASCOT Score",35.6300000,,-0.1961444,0.0494193,NO,0.00037160000647418,0.1077132
AQKVEAQGGK,nta,A,2,true,"Arg/N-end rule pathway Roots",80,25728785,"MASCOT Score",49.8100000,,,,,0.011970000341535,
VEAQGGKGANLWDDGSTHDAVTK,cr,K,11,true,"Open search Plant PTM Viewer 2.0 - Crotonylation",164c,TBA,,,,,,,,
VEAQGGKGANLWDDGSTHDAVTK,ub,K,11,true,"upl3 mutant / wildtype",168,35926874,"MaxQuant score",147.2600000,1.0000000,-0.3940316,,,4.3248199653855E-25,-0.7071700
GANLWDDGSTHDAVTK,ph,S,20,true,"srk2dei ABA signaling phopshoproteomics",83,23572148,"MASCOT Score",22.0000000,,,,,,-0.0006000
GANLWDDGSTHDAVTK,ph,S,20,true,"SnRK2 protein kinase substrates",85,23776212,XCorr,4.7149615,0.9660000,,,,0.00083714601350948,
GANLWDDGSTHDAVTK,ph,S,20,true,"Lateral root-induction - NAA vs control",106,23328941,"MASCOT Score",46.0000000,,,,,,
GANLWDDGSTHDAVTK,ph,S,20,true,"Col-0 callus - FC Col-0 vs. Col-0 Xray",111a,31410901,,24.7000000,,1.2927510,0.0000000,NO,,0.0549205
GANLWDDGSTHDAVTK,ph,S,20,true,"Col-0 X-ray callus - FC Col-0 vs. Col-0 Xray",111b,31410901,,24.7000000,,1.2927510,0.0000000,NO,,0.0549205
GANLWDDGSTHDAVTK,ph,S,20,true,"atm callus - FC atm vs. atm Xray",111c,31410901,,24.7000000,,1.1917945,0.0000000,NO,,0.0549205
GANLWDDGSTHDAVTK,ph,S,20,true,"atm-3 X-ray callus - FC atm vs. atm Xray",111d,31410901,,24.7000000,,1.1917945,0.0000000,NO,,0.0549205
GANLWDDGSTHDAVTK,ph,S,20,true,"Tissue atlas Arabidopsis - ProteomicsDB",114,32188942,"MaxQuant score",300.2800000,0.9924050,,,,0,
GANLWDDGSTHDAVTK,ph,T,26,true,"srk2dei ABA signaling phopshoproteomics",83,23572148,"MASCOT Score",35.0000000,,,,,,-0.0008000
GANLWDDGSTHDAVTK,ph,T,26,true,"Lateral root-induction - NAA vs control",106,23328941,"MASCOT Score",23.0000000,,0.0260314,0.9832994,NO,,
QLTAFGSDDGTVWDDGAYVGVK,ph,S,160,true,"SnRK2 protein kinase substrates",85,23776212,XCorr,3.5791230,1.0000000,,,,3.6544800963156E-8,
QLTAFGSDDGTVWDDGAYVGVK,ph,S,160,true,"Col-0 callus - FC Col-0 vs. Col-0 Xray",111a,31410901,,73.0100000,,1.6369457,0.0000000,NO,,1.6273870
QLTAFGSDDGTVWDDGAYVGVK,ph,S,160,true,"Col-0 X-ray callus - FC Col-0 vs. Col-0 Xray",111b,31410901,,73.0100000,,1.6369457,0.0000000,NO,,1.6273870
QLTAFGSDDGTVWDDGAYVGVK,ph,S,160,true,"atm callus - FC atm vs. atm Xray",111c,31410901,,73.0100000,,2.5272933,0.0000000,NO,,1.6273870
QLTAFGSDDGTVWDDGAYVGVK,ph,S,160,true,"atm-3 X-ray callus - FC atm vs. atm Xray",111d,31410901,,73.0100000,,2.5272933,0.0000000,NO,,1.6273870
QLTAFGSDDGTVWDDGAYVGVK,ph,T,164,true,"Large-scale phosphorylation discovery",44,23111157,XCorr,2.9650000,,,,,,
KVYVGQAQDGISAVK,cr,K,176,false,"Open search Plant PTM Viewer 2.0 - Crotonylation",164c,TBA,,,,,,,,
FVYDKSPEEVTGEEHGK,cr,K,195,false,"Open search Plant PTM Viewer 2.0 - Crotonylation",164c,TBA,,,,,,,,
FVYDKSPEEVTGEEHGK,ub,K,195,false,"upl3 mutant / wildtype",168,35926874,"MaxQuant score",84.4100000,1.0000000,-1.3997302,0.4220000,NO,3.6360900139698E-6,1.6485000
FVYDKSPEEVTGEEHGK,ph,S,196,false,"Ethylene-regulated phosphorylation ein2 mutant",30,19253305,"MASCOT Score",67.6768000,,,,,,-5.7130240
FVYDKSPEEVTGEEHGK,ph,S,196,false,"Nitrogen deprivation Ph response",39,22329444,,,,,,,,
FVYDKSPEEVTGEEHGK,ph,S,196,false,"PAMP-triggered phosphorylation",48,24601666,"MASCOT Score",22.5900000,,,,,,
FVYDKSPEEVTGEEHGK,ph,S,196,false,"srk2dei ABA signaling phopshoproteomics",83,23572148,"MASCOT Score",31.0000000,,,,,,0.0012000
FVYDKSPEEVTGEEHGK,ph,S,196,false,"SnRK2 protein kinase substrates",85,23776212,XCorr,3.6156800,1.0000000,,,,1.9197199385701E-11,
FVYDKSPEEVTGEEHGK,ph,S,196,false,"TOR Kinase and ABA Receptor",100,29290610,XCorr,4.7096195,0.9864000,,,,0.00074460002360865,
FVYDKSPEEVTGEEHGK,ph,S,196,false,"Tissue atlas Arabidopsis - ProteomicsDB",114,32188942,"MaxQuant score",230.7100000,1.0000000,,,,0,
SPEEVTGEEHGK,ph,S,196,false,"TOR Kinase and ABA Receptor",100,29290610,XCorr,3.4112866,1.0000000,,,,6.5849999373313E-5,
SDGSVITMLR,nt,S,238,false,"Arg/N-end rule seed, prt6 vs. Wt",99,29168982,"MASCOT Score",49.7000000,,-0.4922374,0.1721736,NO,0.0037360000424087,-0.7081440
QTSPPFGLE,nt,Q,253,false,"Arg/N-end rule seed, prt6 vs. Wt",99,29168982,"MASCOT Score",43.8100000,,-1.0863912,0.1167429,NO,0.045759998261929,-0.1033422
ADVLLHKIGVHVRPLSN,pgk,K,288,true,"Open search Plant PTM Viewer 2.0 - 3pgK",164f,TBA,,,,,,,,
IGVHVRPLSN,ph,S,297,true,"Nitrogen deprivation Ph response",39,22329444,,,,,,,,
IGVHVRPLSN,ph,S,297,true,"MAPK Arabidopsis substrates",45,23172892,"MaxQuant Score",90.8270000,,,,,,
IGVHVRPLSN,ph,S,297,true,"SIRK1 phosphorylation",86a,23820729,"MaxQuant Score",65.6210000,1.0000000,,,,0.68999999761581,6.0590000
IGVHVRPLSN,ph,S,297,true,"SIRK1 exp - sirk1 mutant vs WT",86b,23820729,,,,-0.0038470,,NO,,
IGVHVRPLSN,ph,S,297,true,"Col-0 callus - FC Col-0 vs. Col-0 Xray",111a,31410901,,37.5600000,,-0.4029323,0.0000000,NO,,0.0041204
IGVHVRPLSN,ph,S,297,true,"Col-0 X-ray callus - FC Col-0 vs. Col-0 Xray",111b,31410901,,37.5600000,,-0.4029323,0.0000000,NO,,0.0041204
IGVHVRPLSN,ph,S,297,true,"atm callus - FC atm vs. atm Xray",111c,31410901,,37.5600000,,-0.1183272,0.0000000,NO,,0.0041204
IGVHVRPLSN,ph,S,297,true,"atm-3 X-ray callus - FC atm vs. atm Xray",111d,31410901,,37.5600000,,-0.1183272,0.0000000,NO,,0.0041204
IGVHVRPLSN,ph,S,297,true,"Tissue atlas Arabidopsis - ProteomicsDB",114,32188942,"MaxQuant score",177.1600000,1.0000000,,,,2.8558000408907E-8,
