Peptide,PTM,ModifiedAA,ModifiedPosition,PeptideUniqueToGene,ExperimentDesc,ExpID,PubmedID,ScoreType,IdentScore,LocProb,Log2FChange,PQ-val,QuantSig,PEP,MassErrorPPM
SLGELLASNSNNHFSRR,ph,S,18,true,"Tissue atlas Arabidopsis - ProteomicsDB",114,32188942,"MaxQuant score",135.4700000,0.8744530,,,,1.4264499581529E-9,
SLGELLASNSNNHFSR,ph,S,20,true,"atm and atr DNA damage response",88,25561503,"MASCOT Score",69.0000000,0.9970000,,,,,0.1700000
SLGELLASNSNNHFSR,ph,S,20,true,"Col-0 callus - FC Col-0 vs. Col-0 Xray",111a,31410901,,48.0900000,,-0.9222856,0.0000000,NO,,0.9796539
SLGELLASNSNNHFSR,ph,S,20,true,"Col-0 X-ray callus - FC Col-0 vs. Col-0 Xray",111b,31410901,,48.0900000,,-0.9222856,0.0000000,NO,,0.9796539
SLGELLASNSNNHFSR,ph,S,20,true,"atm callus - FC atm vs. atm Xray",111c,31410901,,48.0900000,,4.1399278,0.0000000,NO,,0.9796539
SLGELLASNSNNHFSR,ph,S,20,true,"atm-3 X-ray callus - FC atm vs. atm Xray",111d,31410901,,48.0900000,,4.1399278,0.0000000,NO,,0.9796539
SLGELLASNSNNHFSR,ph,S,20,true,"Tissue atlas Arabidopsis - ProteomicsDB",114,32188942,"MaxQuant score",348.6700000,0.9999440,,,,0,
SLGELLASNSNNHFSR,ph,S,25,true,"Tissue atlas Arabidopsis - ProteomicsDB",114,32188942,"MaxQuant score",159.0300000,0.9999750,,,,8.1303297698888E-14,
SGSTIDDHDEEALK,ph,S,28,true,"atm and atr DNA damage response",88,25561503,"MASCOT Score",43.0000000,0.9980000,,,,,-0.5100000
SGSTIDDHDEEALK,ph,S,28,true,"Tissue atlas Arabidopsis - ProteomicsDB",114,32188942,"MaxQuant score",305.4800000,1.0000000,,,,0,
SGSTIDDHDEEALK,ph,S,30,true,"Tissue atlas Arabidopsis - ProteomicsDB",114,32188942,"MaxQuant score",256.5200000,1.0000000,,,,0,
WAALEKLPTFAR,ph,T,50,true,"Tissue atlas Arabidopsis - ProteomicsDB",114,32188942,"MaxQuant score",78.2490000,1.0000000,,,,0.00080973497824743,
LRTTIIHPHEDLVDVTK,ph,T,57,true,"Tissue atlas Arabidopsis - ProteomicsDB",114,32188942,"MaxQuant score",193.9600000,0.7535390,,,,2.1022195483893E-39,
CQGVGTR,sno,C,248,false,"hot5-4 / wildtype, FAT-switch S-nitrosoproteome",169,37277371,,,,,,,,
