Peptide,PTM,ModifiedAA,ModifiedPosition,PeptideUniqueToGene,ExperimentDesc,ExpID,PubmedID,ScoreType,IdentScore,LocProb,Log2FChange,PQ-val,QuantSig,PEP,MassErrorPPM
QSLLFQDLASPVSAR,ph,S,23,true,"TOR Kinase and ABA Receptor",100,29290610,XCorr,3.4496806,0.9998000,,,,3.7140000586078E-6,
QSLLFQDLASPVSAR,ph,S,23,true,"Lateral root-induction - NAA vs control",106,23328941,"MASCOT Score",25.0000000,,,,,,
QSLLFQDLASPVSAR,ph,S,23,true,"Phospho cell culture sucrose/TOR",109,30833711,,,0.9376780,,,,,
QSLLFQDLASPVSAR,ph,S,23,true,"Tissue atlas Arabidopsis - ProteomicsDB",114,32188942,"MaxQuant score",138.7700000,1.0000000,,,,5.2917499715477E-7,
QSLLFQDLASPVSAR,ph,S,26,true,"Tissue atlas Arabidopsis - ProteomicsDB",114,32188942,"MaxQuant score",138.7700000,1.0000000,,,,5.2917499715477E-7,
GKFSSPGQAAAVSALWR,ph,S,33,true,"Tissue atlas Arabidopsis - ProteomicsDB",114,32188942,"MaxQuant score",119.2700000,1.0000000,,,,1.7373800176301E-9,
GKFSSPGQAAAVSALWR,ph,S,34,true,"Tissue atlas Arabidopsis - ProteomicsDB",114,32188942,"MaxQuant score",166.3000000,1.0000000,,,,1.2564000001954E-17,
FSSPGQAAAVSALWR,ph,S,34,true,"TOR Kinase and ABA Receptor",100,29290610,XCorr,4.0439572,0.9096000,,,,0.00081070000305772,
SDFSPESGIADYSASPDAK,ph,S,69,true,"Tissue atlas Arabidopsis - ProteomicsDB",114,32188942,"MaxQuant score",311.9200000,0.9999790,,,,0,
SDFSPESGIADYSASPDAK,ph,S,78,true,"Lateral root-induction - NAA vs control",106,23328941,"MASCOT Score",28.0000000,,,,,,
SDFSPESGIADYSASPDAK,ph,S,78,true,"Tissue atlas Arabidopsis - ProteomicsDB",114,32188942,"MaxQuant score",234.6200000,0.9949510,,,,0,
SDFSPESGIADYSASPDAK,ph,S,80,true,"Arabidopsis root NAA phosphoproteome",18a,27643528,"MaxQuant Score",89.2720000,0.9830000,,,,1.1420000362028E-11,-0.4030000
SDFSPESGIADYSASPDAK,ph,S,80,true,"Phosphoproteomic analysis of seed maturation",42,22440515,"MASCOT Score",77.0000000,,,,,,-2.1000000
SDFSPESGIADYSASPDAK,ph,S,80,true,"Large-scale phosphorylation discovery",44,23111157,XCorr,3.9110000,,,,,,
SDFSPESGIADYSASPDAK,ph,S,80,true,"Tyrosine phosphorylation in Arabidopsis",59,18463617,"MASCOT Score",80.0000000,,,,,,-1.0875973
SDFSPESGIADYSASPDAK,ph,S,80,true,"Chloroplast kinase substrates",60,19376835,"MASCOT Score",41.1400000,,,,,,-2.4112600
SDFSPESGIADYSASPDAK,ph,S,80,true,"srk2dei ABA signaling phopshoproteomics",83,23572148,"MASCOT Score",49.0000000,,,,,,0.0017000
SDFSPESGIADYSASPDAK,ph,S,80,true,"LAXIC - ABA stress",84a,23660473,XCorr,5.7300000,1.0000000,,,,7.0699999674129E-13,
SDFSPESGIADYSASPDAK,ph,S,80,true,"LAXIC - mannitol vs control",84b,23660473,XCorr,4.9100000,1.0000000,,,,4.1800001273948E-16,
SDFSPESGIADYSASPDAK,ph,S,80,true,"SnRK2 protein kinase substrates",85,23776212,XCorr,4.9149590,1.0000000,,,,7.9024997830857E-5,
SDFSPESGIADYSASPDAK,ph,S,80,true,"atm and atr DNA damage response",88,25561503,"MASCOT Score",71.0000000,1.0000000,,,,,-0.2200000
SDFSPESGIADYSASPDAK,ph,S,80,true,"Protein sumoylation and phosphorylation cross-talk",97,28419593,,,,,,,,
SDFSPESGIADYSASPDAK,ph,S,80,true,"TOR Kinase and ABA Receptor",100,29290610,XCorr,6.7583466,1.0000000,,,,5.0319998168291E-10,
SDFSPESGIADYSASPDAK,ph,S,80,true,"Lateral root-induction - NAA vs control",106,23328941,"MASCOT Score",76.0000000,,,,,,
SDFSPESGIADYSASPDAK,ph,S,80,true,"Phospho cell culture sucrose/TOR",109,30833711,,,0.9979570,,,,,
SDFSPESGIADYSASPDAK,ph,S,80,true,"Col-0 callus - FC Col-0 vs. Col-0 Xray",111a,31410901,,95.9900000,,0.3856409,0.0000000,NO,,1.2186954
SDFSPESGIADYSASPDAK,ph,S,80,true,"Col-0 X-ray callus - FC Col-0 vs. Col-0 Xray",111b,31410901,,95.9900000,,0.3856409,0.0000000,NO,,1.2186954
SDFSPESGIADYSASPDAK,ph,S,80,true,"atm callus - FC atm vs. atm Xray",111c,31410901,,95.9900000,,0.3721325,0.0000000,NO,,1.2186954
SDFSPESGIADYSASPDAK,ph,S,80,true,"atm-3 X-ray callus - FC atm vs. atm Xray",111d,31410901,,95.9900000,,0.3721325,0.0000000,NO,,1.2186954
SDFSPESGIADYSASPDAK,ph,S,80,true,"Tissue atlas Arabidopsis - ProteomicsDB",114,32188942,"MaxQuant score",348.4000000,0.9999950,,,,0,
SDFSPESGIADYSASPDAK,ph,S,80,true,"Touch-induced phosphorylation: 40s touch vs untouc",136,30291188,"MASCOT score",97.5000000,,-0.0608801,0.7533659,NO,,1.3416011
SDFSPESGIADYSASPDAKSDRR,ub,K,84,true,"Arabidopsis ubiquitination COFRADIC",40,26744219,"MaxQuant Score",63.8690000,1.0000000,,,,7.6919997064537E-14,0.0150000
SDFSPESGIADYSASPDAKSDR,ph,S,85,true,"Tissue atlas Arabidopsis - ProteomicsDB",114,32188942,"MaxQuant score",153.9300000,1.0000000,,,,2.0084501069924E-34,
GKLEASPSFSLLNAQQSQQVSGSPSWWSQSK,ph,S,111,true,"TOR Kinase and ABA Receptor",100,29290610,XCorr,5.0626140,0.8675000,,,,1.064000025508E-5,
GKLEASPSFSLLNAQQSQQVSGSPSWWSQSK,ph,S,111,true,"Tissue atlas Arabidopsis - ProteomicsDB",114,32188942,"MaxQuant score",304.5400000,0.9857140,,,,0,
LEASPSFSLLNAQQSQQVSGSPSWWSQSK,ph,S,111,true,"TOR Kinase and ABA Receptor",100,29290610,XCorr,5.7430148,0.8809000,,,,2.295000030017E-7,
AGSSTEQDDKGK,ph,S,137,true,"atm and atr DNA damage response",88,25561503,"MASCOT Score",25.0000000,1.0000000,,,,,-0.4500000
AGSSTEQDDKGK,ph,S,138,true,"atm and atr DNA damage response",88,25561503,"MASCOT Score",25.0000000,1.0000000,,,,,-0.4500000
GKGSPVEGVVQPGALVTLPPPR,ph,S,148,true,"TOR Kinase and ABA Receptor",100,29290610,XCorr,3.7634346,1.0000000,,,,7.3380000742418E-8,
GSPVEGVVQPGALVTLPPPR,ph,S,148,true,"TOR Kinase and ABA Receptor",100,29290610,XCorr,4.6727171,1.0000000,,,,1.6640000467305E-5,
GSPVEGVVQPGALVTLPPPR,ph,S,148,true,"Tissue atlas Arabidopsis - ProteomicsDB",114,32188942,"MaxQuant score",213.5500000,1.0000000,,,,0,
PLSRPQYLQNGSAFSPQPSGGAMASPSK,ph,S,303,true,"Tissue atlas Arabidopsis - ProteomicsDB",114,32188942,"MaxQuant score",147.0800000,0.9991700,,,,0,
PQYLQNGSAFSPQPSGGAMASPSK,ph,S,313,true,"Tissue atlas Arabidopsis - ProteomicsDB",114,32188942,"MaxQuant score",324.1200000,0.9972390,,,,0,
