Peptide,PTM,ModifiedAA,ModifiedPosition,PeptideUniqueToGene,ExperimentDesc,ExpID,PubmedID,ScoreType,IdentScore,LocProb,Log2FChange,PQ-val,QuantSig,PEP,MassErrorPPM
SSSFALILR,ph,S,20,true,"atm and atr DNA damage response",88,25561503,"MASCOT Score",28.0000000,0.9430000,,,,,-1.7300000
NTSSGNAEGSLFSKGSLMQSIYK,me2,K,728,true,"Arabidopsis protein methylome",123,31809900,"MaxQuant Score",217.7100000,1.0000000,,,,0,-0.0562860
NTSSGNAEGSLFSKGSLMQSIYK,me3,K,728,true,"Arabidopsis protein methylome",123,31809900,"MaxQuant Score",190.9100000,1.0000000,,,,0,-0.3526100
RPSSPLTDNSSALPFLK,ph,S,740,true,"Tissue atlas Arabidopsis - ProteomicsDB",114,32188942,"MaxQuant score",96.8810000,0.7967070,,,,1.0850000080609E-6,
RPSSPLTDNSSALPFLK,ph,S,741,true,"Large-scale phosphorylation discovery",44,23111157,XCorr,3.6480000,,,,,,
RPSSPLTDNSSALPFLK,ph,S,741,true,"Tissue atlas Arabidopsis - ProteomicsDB",114,32188942,"MaxQuant score",200.4500000,0.9790730,,,,3.4941237078093E-40,
NQVVEEEEEEEETDDDSLIRDK,ph,T,926,true,"SnRK2 protein kinase substrates",85,23776212,XCorr,2.4767497,0.9990000,,,,0.0030100499279797,
NQVVEEEEEEEETDDDSLIRDK,ph,T,926,true,"TOR Kinase and ABA Receptor",100,29290610,XCorr,4.6726127,1.0000000,,,,0.0035880000796169,
NQVVEEEEEEEETDDDSLIR,ph,T,926,true,"LAXIC - ABA stress",84a,23660473,XCorr,5.3000000,1.0000000,,,,4.1699999542288E-7,
NQVVEEEEEEEETDDDSLIR,ph,T,926,true,"LAXIC - mannitol vs control",84b,23660473,XCorr,5.6600000,1.0000000,,,,3.1700000263646E-11,
NQVVEEEEEEEETDDDSLIR,ph,T,926,true,"SnRK2 protein kinase substrates",85,23776212,XCorr,4.8537364,1.0000000,,,,2.6545798892386E-9,
NQVVEEEEEEEETDDDSLIR,ph,T,926,true,"Phospho cell culture sucrose/TOR",109,30833711,,,0.9989020,,,,,
NQVVEEEEEEEETDDDSLIR,ph,T,926,true,"Tissue atlas Arabidopsis - ProteomicsDB",114,32188942,"MaxQuant score",490.1700000,0.9988060,,,,0,
