Peptide,PTM,ModifiedAA,ModifiedPosition,PeptideUniqueToGene,ExperimentDesc,ExpID,PubmedID,ScoreType,IdentScore,LocProb,Log2FChange,PQ-val,QuantSig,PEP,MassErrorPPM
IVVELNGDNTKR,ac,K,86,true,"Quantitative Acetylproteomics",101,29440448,,,,,,,,
YTSYDGPCQAEK,sno,C,273,true,"Site-specific nitrosomeproteomic id - gsnor1-3",90a,25699590,XCorr,3.0571966,,,,,0.00080500001786277,-5.6407662
YTSYDGPCQAEK,sno,C,273,true,"Site-specific nitrosomeproteomic id - gsnor1-3",90b,25699590,XCorr,2.8100000,,,,,0.048080001026392,-7.3900000
SQPIPDNQNASVVAVVGR,ng,N,415,true,"Conserved N-glycosylation",74,22633491,"MaxQuant Score",169.4100000,0.9960000,,,,0,-2.5020000
SQPIPDNQNASVVAVVGR,ng,N,415,true,"N-glycan occupancy Arabidopsis glycoproteins",87,23994444,"Ladder score",54.3000000,,,,,,
SQPIPDNQNASVVAVVGR,ng,N,415,true,"N-Glycopeptide Profiling in Arabidopsis Infloresce",132,27067053,"MOWSE score",26.4000000,,,,,0.016000000759959,
SQPIPDNQNASVVAVVGR,ng,N,415,true,"ER-associatied N-glycan degradation chilling stres",133,27558752,,,,,,,,
SQPIPDNQNASVVAVVGR,ng,N,415,true,"N-linked Glycan Micro-heterogeneity Arabidopsis",134,29237727,,,,,,,,
SQPIPDNQNASVVAVVGR,ng,N,415,true,"UDP-GlcNAc transporter glycopeptide analysis",135,30224661,,,,,,,1.878052885597E-15,0.3000000
ELKWKDQSGK,ph,S,529,true,"Tyrosine phosphorylation in Arabidopsis",59,18463617,"MASCOT Score",22.0000000,,,,,,-0.4623900
