Peptide,PTM,ModifiedAA,ModifiedPosition,PeptideUniqueToGene,ExperimentDesc,ExpID,PubmedID,ScoreType,IdentScore,LocProb,Log2FChange,PQ-val,QuantSig,PEP,MassErrorPPM
AAEETIESLKNQLK,ac,K,162,true,"Quantitative Acetylproteomics",101,29440448,,,,,,,,
ALVLKEK,ac,K,175,false,"Quantitative Acetylproteomics",101,29440448,,,,,,,,
AGEDKEALETKLR,ac,K,256,true,"Quantitative Acetylproteomics",101,29440448,,,,,,,,
FNASLAKK,ac,K,294,true,"Quantitative Acetylproteomics",101,29440448,,,,,,,,
TQSELDSK,ph,S,332,true,"atm and atr DNA damage response",88,25561503,"MASCOT Score",27.0000000,1.0000000,,,,,-0.9400000
ESYIQKLDSISK,ac,K,361,true,"Histone deacetylases substrates - hda14 vs WT",98e,29061669,"MaxQuant Score",45.8000000,1.0000000,0.6010000,0.1862087,NO,0.0049999998882413,
VADLTEKYEDSKR,ac,K,421,true,"Quantitative Acetylproteomics",101,29440448,,,,,,,,
DKVADLTEKYEDSKR,ac,K,426,true,"Quantitative Acetylproteomics",101,29440448,,,,,,,,
VADLTEKYEDSKR,ac,K,426,true,"Quantitative Acetylproteomics",101,29440448,,,,,,,,
HELEGTKK,ac,K,447,true,"Quantitative Acetylproteomics",101,29440448,,,,,,,,
NLDAEKQK,ac,K,500,true,"Quantitative Acetylproteomics",101,29440448,,,,,,,,
QKNEISASELALEK,ac,K,502,true,"Quantitative Acetylproteomics",101,29440448,,,,,,,,
ESSVKNQSLQK,ac,K,537,true,"Quantitative Acetylproteomics",101,29440448,,,,,,,,
TVLSLNKEVK,ac,K,571,true,"Histone deacetylases - hda14 vs WT (thylakoids)",98d,29061669,"MaxQuant Score",96.2000000,1.0000000,-0.0030000,0.9977001,NO,0.0060000000521541,
EARKSLETDLEEAVK,ph,S,589,true,"Chloroplast kinase substrates",60,19376835,"MASCOT Score",39.4200000,,,,,,-1.2132000
KSLETDLEEAVK,ph,S,589,true,"STN8 phosphoproteome",38,21768351,"MASCOT Score",76.4100000,,,,,,-1.0538500
KSLETDLEEAVK,ph,S,589,true,"atm and atr DNA damage response",88,25561503,"MASCOT Score",54.0000000,1.0000000,,,,,0.4200000
KSLETDLEEAVK,ph,S,589,true,"Tissue atlas Arabidopsis - ProteomicsDB",114,32188942,"MaxQuant score",228.4200000,1.0000000,,,,0,
KSLETDLEEAVK,ph,S,589,true,"Touch-induced phosphorylation: 40s touch vs untouc",136,30291188,"MASCOT score",93.4600000,,0.0264811,0.8187582,NO,,-1.3229907
SLETDLEEAVK,ph,S,589,true,"TOR Kinase and ABA Receptor",100,29290610,XCorr,2.8801117,1.0000000,,,,2.7550000595511E-5,
SLGEAKNASK,ac,K,640,true,"Quantitative Acetylproteomics",101,29440448,,,,,,,,
EREVLEKK,ac,K,669,true,"Quantitative Acetylproteomics",101,29440448,,,,,,,,
EKSDNTVTVKK,ac,K,714,true,"Quantitative Acetylproteomics",101,29440448,,,,,,,,
