Peptide,PTM,ModifiedAA,ModifiedPosition,PeptideUniqueToGene,ExperimentDesc,ExpID,PubmedID,ScoreType,IdentScore,LocProb,Log2FChange,PQ-val,QuantSig,PEP,MassErrorPPM
IVVDKAYLYQEDKPLTVCK,ub,K,23,true,"upl3 mutant / wildtype",168,35926874,"MaxQuant score",97.2710000,1.0000000,0.0496308,,,1.3014799549182E-7,-0.6059000
AYLYQEDKPLTVCK,ac,K,31,true,"Histone deacetylases substrates - hda14 vs WT",98e,29061669,"MaxQuant Score",75.6000000,1.0000000,0.2570000,0.7870458,NO,2.4000000848901E-6,
AYLYQEDKPLTVCK,sno,C,36,true,"hot5-4 / wildtype, FAT-switch S-nitrosoproteome",169,37277371,,,,,,,,
SEGQKPIFSVR,ub,K,109,true,"upl3 mutant / wildtype",168,35926874,"MaxQuant score",83.0450000,1.0000000,-1.2863042,0.3219000,NO,0.00029213601374067,-0.0105910
RSSIIGR,ph,S,118,false,"srk2dei ABA signaling phopshoproteomics",83,23572148,"MASCOT Score",39.0000000,,,,,,-0.0006000
RSSIIGR,ph,S,118,false,"LAXIC - mannitol vs control",84b,23660473,XCorr,2.1100000,0.9980000,,,,0.0083808796480298,
RSSIIGR,ph,S,118,false,"SnRK2 protein kinase substrates",85,23776212,XCorr,2.5241311,0.9980000,,,,0.045162301510572,
RSSIIGR,ph,S,118,false,"TOR Kinase and ABA Receptor",100,29290610,XCorr,3.0709388,0.9997000,,,,0.0015369999455288,
RSSIIGR,ph,S,118,false,"Col-0 callus - FC Col-0 vs. Col-0 Xray",111a,31410901,,45.7400000,,5.2825550,0.0000000,NO,,-0.0805240
RSSIIGR,ph,S,118,false,"Col-0 X-ray callus - FC Col-0 vs. Col-0 Xray",111b,31410901,,45.7400000,,5.2825550,0.0000000,NO,,-0.0805240
RSSIIGR,ph,S,118,false,"atm callus - FC atm vs. atm Xray",111c,31410901,,45.7400000,,-3.1162136,0.0000000,NO,,-0.0805240
RSSIIGR,ph,S,118,false,"atm-3 X-ray callus - FC atm vs. atm Xray",111d,31410901,,45.7400000,,-3.1162136,0.0000000,NO,,-0.0805240
RSSIIGR,ph,S,118,false,"Tissue atlas Arabidopsis - ProteomicsDB",114,32188942,"MaxQuant score",87.2580000,0.9813090,,,,0.015932800248265,
