Peptide,PTM,ModifiedAA,ModifiedPosition,PeptideUniqueToGene,ExperimentDesc,ExpID,PubmedID,ScoreType,IdentScore,LocProb,Log2FChange,PQ-val,QuantSig,PEP,MassErrorPPM
SHPGNPAIAEFDWTTSGTPR,ph,T,74,true,"Tissue atlas Arabidopsis - ProteomicsDB",114,32188942,"MaxQuant score",197.8600000,0.9873840,,,,0,
TKATPSPDKEPPK,ph,T,88,true,"Tissue atlas Arabidopsis - ProteomicsDB",114,32188942,"MaxQuant score",148.3600000,1.0000000,,,,4.0740401345829E-6,
TKATPSPDKEPPK,ph,S,90,true,"Tissue atlas Arabidopsis - ProteomicsDB",114,32188942,"MaxQuant score",148.3600000,1.0000000,,,,4.0740401345829E-6,
ATPSPDKEPPK,ph,S,90,true,"atm and atr DNA damage response",88,25561503,"MASCOT Score",47.0000000,1.0000000,,,,,-1.1800000
ATPSPDKEPPK,ac,K,93,true,"Histone deacetylases substrates - hda14 vs WT",98e,29061669,"MaxQuant Score",45.4000000,1.0000000,0.0180000,0.9772372,NO,0.0070000002160668,
KDAEGEKSEGGGEENSHVK,ph,S,116,true,"Tissue atlas Arabidopsis - ProteomicsDB",114,32188942,"MaxQuant score",251.0900000,1.0000000,,,,0,
DAEGEKSEGGGEENSHVK,ph,S,116,true,"STN8 phosphoproteome",38,21768351,"MASCOT Score",60.4500000,,,,,,-0.7378010
DAEGEKSEGGGEENSHVK,ph,S,116,true,"Chloroplast kinase substrates",60,19376835,"MASCOT Score",52.0600000,,,,,,-0.7378010
DAEGEKSEGGGEENSHVK,ph,S,116,true,"atm and atr DNA damage response",88,25561503,"MASCOT Score",32.0000000,1.0000000,,,,,-1.3500000
DAEGEKSEGGGEENSHVK,ph,S,116,true,"TOR Kinase and ABA Receptor",100,29290610,XCorr,4.7718253,1.0000000,,,,7.172000096034E-7,
ENIVAEETPNAAPVQEEGESMK,ph,T,167,true,"Tissue atlas Arabidopsis - ProteomicsDB",114,32188942,"MaxQuant score",172.8300000,1.0000000,,,,1.1210387714599E-44,
ENIVAEETPNAAPVQEEGESMKEK,ph,S,179,true,"Tissue atlas Arabidopsis - ProteomicsDB",114,32188942,"MaxQuant score",131.0300000,0.9999980,,,,1.1830799628049E-34,
ALDSVDDKSK,ph,S,187,true,"atm and atr DNA damage response",88,25561503,"MASCOT Score",40.0000000,1.0000000,,,,,-3.9600000
ALDSVDDK,ph,S,187,true,"atm and atr DNA damage response",88,25561503,"MASCOT Score",31.0000000,1.0000000,,,,,-2.2000000
ALDSVDDK,ph,S,187,true,"Tissue atlas Arabidopsis - ProteomicsDB",114,32188942,"MaxQuant score",90.1420000,1.0000000,,,,0.0068345000036061,
DTGSIEKNSVDVEKK,ph,S,203,true,"Tissue atlas Arabidopsis - ProteomicsDB",114,32188942,"MaxQuant score",216.9000000,1.0000000,,,,0,
DTGSIEKNSVDVEK,ph,S,208,true,"Tissue atlas Arabidopsis - ProteomicsDB",114,32188942,"MaxQuant score",115.8000000,0.9999910,,,,9.5539202447981E-5,
TVEASDEKKNSEAETR,nt,T,215,true,"Metacaspase9 substrates - in vitro rMC9",51c,23964026,"MASCOT Score",81.0000000,,4.0086843,,NO,,-1.7474025
TVEASDEKKNSEAETR,ph,S,219,true,"Tissue atlas Arabidopsis - ProteomicsDB",114,32188942,"MaxQuant score",92.5630000,0.9998980,,,,2.2406600692193E-5,
TVEASDEKK,ph,S,219,true,"atm and atr DNA damage response",88,25561503,"MASCOT Score",33.0000000,1.0000000,,,,,-2.6200000
TVEASDEKKNSEAETR,ph,S,225,true,"Tissue atlas Arabidopsis - ProteomicsDB",114,32188942,"MaxQuant score",112.3600000,0.9829280,,,,7.4035902741798E-8,
KNSEAETR,ph,S,225,true,"atm and atr DNA damage response",88,25561503,"MASCOT Score",23.0000000,1.0000000,,,,,-1.7100000
