Peptide,PTM,ModifiedAA,ModifiedPosition,PeptideUniqueToGene,ExperimentDesc,ExpID,PubmedID,ScoreType,IdentScore,LocProb,Log2FChange,PQ-val,QuantSig,PEP,MassErrorPPM
DNPVMIYMK,mox,M,79,true,"cat2 Methionine oxidation - 3h stress",62b,25693801,"MASCOT Score",39.0000000,,0.1082442,,NO,,
DNPVMIYMK,mox,M,82,true,"cat2 Methionine oxidation - 3h stress",62b,25693801,"MASCOT Score",39.0000000,,0.1082442,,NO,,
GVPESPQCGFSSLAVR,nt,G,84,true,"Mitochondrial intermediate peptidases - icp55 / WT",131a,25732537,,72.3700000,,0.2655778,,,,
GVPESPQCGFSSLAVR,nt,G,84,true,"Mitochondrial intermediate peptidases - oct1-1 / WT",131b,25732537,,71.1400000,,-1.6600163,,,,
GVPESPQCGFSSLAVR,nt,G,84,true,"Mitochondrial intermediate peptidases - oct1-2 / WT",131c,25732537,,61.7100000,,1.4000300,,,,
GVPESPQCGFSSLAVR,ph,S,88,true,"Tissue atlas Arabidopsis - ProteomicsDB",114,32188942,"MaxQuant score",108.6300000,0.9999520,,,,2.64665004579E-7,
GVPESPQCGFSSLAVR,ox,C,91,true,"Redox kickstart of mitochondria",112,31871212,,,,-1.7385167,0.0006433,YES,,
GVPESPQCGFSSLAVR,sno,C,91,true,"hot5-4 / wildtype, FAT-switch S-nitrosoproteome",169,37277371,,,,1.3052913,0.0003520,YES,,
GVPESPQCGFSSLAVR,so,C,91,true,"S-sulfenylation site detection using YAP1C",110,32714340,,,,,,,,
NILEDQELKNAVK,ac,K,120,true,"Quantitative Acetylproteomics",101,29440448,,,,,,,,
GEFIGGSDIILNMHK,mox,M,151,true,"cat2 Methionine oxidation - 3h stress",62b,25693801,"MASCOT Score",86.0000000,,0.1234223,,NO,,
