Peptide,PTM,ModifiedAA,ModifiedPosition,PeptideUniqueToGene,ExperimentDesc,ExpID,PubmedID,ScoreType,IdentScore,LocProb,Log2FChange,PQ-val,QuantSig,PEP,MassErrorPPM
EAQDTTAAAVEVPNLSDSE,nt,E,77,true,"N-terminal ChaFRADIC",92,26010716,"MASCOT Score",55.3000000,,,,,5.838000083358E-10,
EAQDTTAAAVEVPNLSDSE,nt,E,77,true,"HUNTER N-terminome: legumain, GluC and trypsin",119,31951383,"MaxQuant score",248.2400000,,,,,,
EAQDTTAAAVEVPN,nt,E,77,true,"HUNTER N-terminome: legumain, GluC and trypsin",119,31951383,"MaxQuant score",172.7400000,,,,,,
EAQDTTAAAVE,nt,E,77,true,"N-terminal ChaFRADIC",92,26010716,"MASCOT Score",38.7700000,,,,,0.0022839999292046,
AQDTTAAAVEVPNLSDSE,nt,A,78,true,"N-terminal ChaFRADIC",92,26010716,"MASCOT Score",45.1100000,,,,,6.3850002618437E-8,
AQDTTAAAVEVPNLSDSE,nt,A,78,true,"HUNTER N-terminome: legumain, GluC and trypsin",119,31951383,"MaxQuant score",71.5130000,,,,,,
AAVEVPNLSDSE,nt,A,84,true,"N-terminal ChaFRADIC",92,26010716,"MASCOT Score",85.5900000,,,,,4.0340000850847E-7,
DFAGKFK,ac,K,136,true,"Quantitative Acetylproteomics",101,29440448,,,,,,,,
FYKINTDESPNTANR,ac,K,141,true,"Histone deacetylases - apicidin vs control",98a,29061669,"MaxQuant Score",85.0000000,1.0000000,0.1180000,0.6714289,NO,1.5000000530563E-7,
FYKINTDESPNTANR,ac,K,141,true,"Histone deacetylases substrates - TSA vs control",98b,29061669,"MaxQuant Score",85.0000000,1.0000000,0.0900000,0.9977001,NO,1.5000000530563E-7,
FYKINTDESPNTANR,ac,K,141,true,"Histone deacetylases - hda14 vs WT (thylakoids)",98d,29061669,"MaxQuant Score",58.7000000,1.0000000,0.9770000,0.8394600,NO,0.00012099999730708,
FYKINTDESPNTANR,ac,K,141,true,"Histone deacetylases substrates - hda14 vs WT",98e,29061669,"MaxQuant Score",54.0000000,1.0000000,0.0140000,0.9931160,NO,0.00073000002885237,
FYKINTDESPNTANR,ac,K,141,true,"Quantitative Acetylproteomics",101,29440448,,,,,,,,
SVPTVIIFK,ph,S,158,true,"atm and atr DNA damage response",88,25561503,"MASCOT Score",27.0000000,1.0000000,,,,,-0.4700000
SVPTVIIFKGGEKK,ac,K,166,true,"Quantitative Acetylproteomics",101,29440448,,,,,,,,
KDSIIGAVPR,ph,S,173,true,"atm and atr DNA damage response",88,25561503,"MASCOT Score",40.0000000,1.0000000,,,,,-1.8600000
ETLEKTIER,ac,K,185,true,"Quantitative Acetylproteomics",101,29440448,,,,,,,,
ETLEKTIER,ub,K,185,true,"Arabidopsis ubiquitination COFRADIC",40,26744219,"MaxQuant Score",98.0480000,1.0000000,,,,0.003000000026077,0.2730000
