Peptide,PTM,ModifiedAA,ModifiedPosition,PeptideUniqueToGene,ExperimentDesc,ExpID,PubmedID,ScoreType,IdentScore,LocProb,Log2FChange,PQ-val,QuantSig,PEP,MassErrorPPM
SIICLNGTKK,acy,C,12,true,"Arabidopsis S-acylation atlas - Silique",163e,35681017,,,,,,,,
SIICLNGTK,acy,C,12,true,"Arabidopsis S-acylation atlas - Silique",163e,35681017,,,,,,,,
SIICLNGTK,acy,C,12,true,"Arabidopsis S-acylation atlas - Stem",163f,35681017,,,,,,,,
LCSLKSAR,ph,S,74,true,"Tissue atlas Arabidopsis - ProteomicsDB",114,32188942,"MaxQuant score",120.7700000,0.9983930,,,,0.0055143302306533,
AMAYAFSHQWR,ph,S,176,true,"Tissue atlas Arabidopsis - ProteomicsDB",114,32188942,"MaxQuant score",139.4600000,0.9999980,,,,2.9101400400577E-7,
ANATQYLGQASFNLGK,ph,S,191,true,"Tissue atlas Arabidopsis - ProteomicsDB",114,32188942,"MaxQuant score",314.3400000,1.0000000,,,,0,
SSPNNVITK,ph,S,235,true,"atm and atr DNA damage response",88,25561503,"MASCOT Score",44.0000000,1.0000000,,,,,-1.6900000
SSPNNVITK,ph,S,235,true,"Tissue atlas Arabidopsis - ProteomicsDB",114,32188942,"MaxQuant score",91.5490000,0.8544720,,,,0.00046093200217001,
