Peptide,PTM,ModifiedAA,ModifiedPosition,PeptideUniqueToGene,ExperimentDesc,ExpID,PubmedID,ScoreType,IdentScore,LocProb,Log2FChange,PQ-val,QuantSig,PEP,MassErrorPPM
ASFTKTVLIPIAHGTEPLE,nt,A,2,true,"N-terminal ChaFRADIC",92,26010716,"MASCOT Score",26.5300000,,,,,0.0097780004143715,
ASFTKTVLIPIAHGTEPLE,nt,A,2,true,"Arg/N-end rule seed, prt6 vs. Wt",99,29168982,"MASCOT Score",32.1600000,,,,,1.2870000318799E-6,2.3496589
ASFTKTVLIPIAHG,nt,A,2,true,"N-terminal ChaFRADIC",92,26010716,"MASCOT Score",33.8000000,,,,,0.00016159999358933,
ASFTKTVLIPIAHG,nt,A,2,true,"Arg/N-end rule seed, prt6 vs. Wt",99,29168982,"MASCOT Score",43.8600000,,,,,1.0679999832064E-5,1.0139670
ASFTKTVLIPIAH,nt,A,2,true,"Arg/N-end rule seed, prt6 vs. Wt",99,29168982,"MASCOT Score",70.1800000,,,,,0.0042559998109937,-2.1050393
ASFTKTVLIPIAHGTEPLE,nta,A,2,true,"N-terminal ChaFRADIC",92,26010716,"MASCOT Score",26.5300000,,,,,0.0097780004143715,
ASFTKTVLIPIAHGTEPLE,nta,A,2,true,"Arg/N-end rule seed, prt6 vs. Wt",99,29168982,"MASCOT Score",32.1600000,,-0.5708326,0.0500890,NO,1.2870000318799E-6,2.3496589
ASFTKTVLIPIAHGTEPLE,nta,A,2,true,"HUNTER N-terminome: legumain, GluC and trypsin",119,31951383,"MaxQuant score",50.2070000,,,,,,
ASFTKTVLIPIAHGTEPLE,nta,A,2,true,"Arabidopsis translation initiation landscape - NTA",167a,35069635,,,,,,,,
ASFTKTVLIPIAHG,nta,A,2,true,"N-terminal ChaFRADIC",92,26010716,"MASCOT Score",33.8000000,,,,,0.00016159999358933,
ASFTKTVLIPIAHG,nta,A,2,true,"Arg/N-end rule seed, prt6 vs. Wt",99,29168982,"MASCOT Score",43.8600000,,-0.5649724,0.0601951,NO,1.0679999832064E-5,1.0139670
ASFTKTVLIPIAH,nta,A,2,true,"Arg/N-end rule seed, prt6 vs. Wt",99,29168982,"MASCOT Score",70.1800000,,-0.3008798,0.0361414,NO,0.0042559998109937,-2.1050393
TVLIPIAH,nt,T,7,true,"N-terminal ChaFRADIC",92,26010716,"MASCOT Score",56.4500000,,,,,0.00023809999402147,
GGADVTVASVETQVGVDACHGIK,sno,C,49,true,"Site-specific nitrosomeproteomic id - gsnor1-3",90a,25699590,XCorr,2.8414891,,,,,3.211999865016E-5,-3.8080954
GGADVTVASVETQVGVDACHGIK,sno,C,49,true,"Site-specific nitrosomeproteomic id - gsnor1-3",90b,25699590,XCorr,4.2000000,,,,,0.055830001831055,-3.7100000
GGADVTVASVETQVGVDACHGIK,sno,C,49,true,"hot5-4 / wildtype, FAT-switch S-nitrosoproteome",169,37277371,,,,0.9317914,0.0000535,YES,,
RGGADVTVASVETQVGVDACHGIK,so,C,49,true,"S-sulfenylation site detection using YAP1C",110,32714340,,,,,,,,
SLENMVKKQDSDGR,nt,S,88,true,"Arabidopsis translation initiation landscape - NT",167b,35069635,,,,,,,,
NCKSLENMVK,ph,S,88,true,"PAMP-triggered phosphorylation",48,24601666,"MASCOT Score",42.8400000,,,,,,
NCKSLENMVK,ph,S,88,true,"SnRK2 protein kinase substrates",85,23776212,XCorr,2.3890650,1.0000000,,,,0.00016547000268474,
NCKSLENMVK,ph,S,88,true,"atm and atr DNA damage response",88,25561503,"MASCOT Score",26.0000000,1.0000000,,,,,-2.3900000
SLENMVK,ph,S,88,true,"srk2dei ABA signaling phopshoproteomics",83,23572148,"MASCOT Score",44.0000000,,,,,,0.0001000
SLENMVK,ph,S,88,true,"Phospho cell culture sucrose/TOR",109,30833711,,,1.0000000,,,,,
SLENMVK,ph,S,88,true,"Tissue atlas Arabidopsis - ProteomicsDB",114,32188942,"MaxQuant score",234.4900000,1.0000000,,,,1.4033099666132E-36,
SLENMVKK,ac,K,94,true,"Quantitative Acetylproteomics",101,29440448,,,,,,,,
KATGYPVFMEK,ub,K,124,true,"upl3 mutant / wildtype",168,35926874,"MaxQuant score",73.8810000,1.0000000,-0.6371094,,,0.0073739602230489,-1.0095000
LAATCATAVESR,acy,C,139,true,"Arabidopsis S-acylation atlas - Seedling",163d,35681017,,,,,,,,
LAATCATAVESR,ox,C,139,true,"OxiTRAQ Arabidopsis - 5 mM H2O2 versus control",47,24376095,,,,0.0476709,0.4996890,NO,,
LAATCATAVESR,ox,C,139,true,"SPEAR - 10 mM H2O2 / mock",138a,34619326,,,,-3.9240881,0.0021307,YES,,
LAATCATAVESR,sno,C,139,true,"Site-specific nitrosomeproteomic id - gsnor1-3",90a,25699590,XCorr,3.9547405,,,,,6.635000318056E-5,-6.5298084
LAATCATAVESR,sno,C,139,true,"Site-specific nitrosomeproteomic id - gsnor1-3",90b,25699590,XCorr,3.8054159,,,,,0.0030420001130551,-6.9011188
LAATCATAVESR,sno,C,139,true,"hot5-4 / wildtype, FAT-switch S-nitrosoproteome",169,37277371,,,,0.4962177,0.0106742,NO,,
LAATCATAVESR,so,C,139,true,"S-sulfenylation site detection using YAP1C",110,32714340,,,,,,,,
FASCEK,ox,C,292,true,"OxiTRAQ Arabidopsis - 5 mM H2O2 versus control",47,24376095,,,,1.1838705,0.2612986,YES,,
FASCEK,sno,C,292,true,"hot5-4 / wildtype, FAT-switch S-nitrosoproteome",169,37277371,,,,2.2193956,0.0002139,YES,,
FASCEK,so,C,292,true,"S-sulfenylation site detection using YAP1C",110,32714340,,,,,,,,
LVNMLRK,mox,M,298,true,"cat2 Methionine oxidation - 3h stress",62b,25693801,"MASCOT Score",31.0000000,,-0.2828958,,NO,,
