Peptide,PTM,ModifiedAA,ModifiedPosition,PeptideUniqueToGene,ExperimentDesc,ExpID,PubmedID,ScoreType,IdentScore,LocProb,Log2FChange,PQ-val,QuantSig,PEP,MassErrorPPM
MEITNVTEYDAIAKAKLPK,nta,M,1,true,"Stromal N-terminome",96,26371235,"MASCOT Score",58.4200000,,,,,,
MEITNVTEYDAIAK,nta,M,1,false,"Characterization plant N-terminal acetylation",6,22223895,"MASCOT Score",93.7700000,,,,,,
MEITNVTEYDAIAK,nta,M,1,false,"Stromal N-terminome",96,26371235,"MASCOT Score",46.1900000,,,,,,
MEITNVTEYD,nta,M,1,false,"N-term acetylation drought responses",5,26184543,,,,,,,,
MEITNVTEY,nta,M,1,false,"Arabidopsis translation initiation landscape - NTA",167a,35069635,,,,,,,,
EITNVTEYDAIAK,nt,E,2,false,"Characterization plant N-terminal acetylation",6,22223895,"MASCOT Score",78.7300000,,,,,,
AGFKAIALTVDTPR,ac,K,150,false,"Histone deacetylases - apicidin vs control",98a,29061669,"MaxQuant Score",112.2000000,1.0000000,-0.1230000,0.6324119,NO,1.9999999649033E-14,
AGFKAIALTVDTPR,ac,K,150,false,"Histone deacetylases substrates - TSA vs control",98b,29061669,"MaxQuant Score",112.2000000,1.0000000,-0.2120000,0.9794900,NO,1.9999999649033E-14,
AGFKAIALTVDTPR,ac,K,150,false,"Histone deacetylases- hda14 vs WT (low light)",98c,29061669,"MaxQuant Score",129.2900000,1.0000000,0.2300000,0.9885531,NO,1.200000042445E-5,
AGFKAIALTVDTPR,ac,K,150,false,"Histone deacetylases - hda14 vs WT (thylakoids)",98d,29061669,"MaxQuant Score",89.5000000,1.0000000,-0.7030000,0.8394600,NO,2.1299999843905E-6,
AGFKAIALTVDTPR,ac,K,150,false,"Histone deacetylases substrates - hda14 vs WT",98e,29061669,"MaxQuant Score",61.4000000,1.0000000,-0.6900000,0.7413102,NO,0.00036999999429099,
AIALTVDTPR,ph,T,158,false,"srk2dei ABA signaling phopshoproteomics",83,23572148,"MASCOT Score",45.0000000,,,,,,-0.0002000
AIALTVDTPR,ph,T,158,false,"TOR Kinase and ABA Receptor",100,29290610,XCorr,3.1207325,0.9956000,,,,0.0020379999186844,
AIALTVDTPR,ph,T,158,false,"Lateral root-induction - NAA vs control",106,23328941,"MASCOT Score",22.0000000,,,,,,
AIALTVDTPR,ph,T,158,false,"Tissue atlas Arabidopsis - ProteomicsDB",114,32188942,"MaxQuant score",164.0400000,0.9999940,,,,1.0728299457696E-6,
RESDIKNR,ac,K,169,false,"Quantitative Acetylproteomics",101,29440448,,,,,,,,
ESDIKNR,ac,K,169,false,"Quantitative Acetylproteomics",101,29440448,,,,,,,,
MDEANDSGLASYVAGQIDR,ng,N,195,false,"Conserved N-glycosylation",74,22633491,"MaxQuant Score",122.2700000,1.0000000,,,,3.3889999977881E-15,0.2260000
MDEANDSGLASYVAGQIDR,ph,S,201,false,"Tissue atlas Arabidopsis - ProteomicsDB",114,32188942,"MaxQuant score",258.3700000,1.0000000,,,,0,
TLSWK,ph,S,212,false,"srk2dei ABA signaling phopshoproteomics",83,23572148,"MASCOT Score",27.0000000,,,,,,0.0003000
QLDYVPATISALEEVVKATQGR,nt,Q,258,false,"HUNTER N-terminome: legumain, GluC and trypsin",119,31951383,"MaxQuant score",51.5030000,,,,,,
TISALEEVVKATQGR,nt,T,265,false,"Metacaspase9 substrates - 35S:MC9 / mc9",51b,23964026,"MASCOT Score",48.0000000,,1.7692632,,NO,,-2.7444351
GTDVFKALALGASGIFIGR,ub,K,296,false,"upl3 mutant / wildtype",168,35926874,"MaxQuant score",114.5500000,1.0000000,0.1814206,,,1.6119100845757E-11,-1.3841000
DEFELTMALSGCR,ox,C,343,false,"SPEAR - 10 mM H2O2 / mock",138a,34619326,,,,2.5527843,0.0226172,YES,,
DEFELTMALSGCR,ox,C,343,false,"SPEAR - 50 mM H2O2 / mock",138b,34619326,,,,3.0732147,0.0148502,YES,,
SLSEITR,nt,S,345,true,"N-terminal ChaFRADIC",92,26010716,"MASCOT Score",42.0400000,,,,,0.012070000171661,
