Peptide,PTM,ModifiedAA,ModifiedPosition,PeptideUniqueToGene,ExperimentDesc,ExpID,PubmedID,ScoreType,IdentScore,LocProb,Log2FChange,PQ-val,QuantSig,PEP,MassErrorPPM
AVVSQNSSKTVTKFDHCF,nt,A,50,true,"Arabidopsis translation initiation landscape - NT",167b,35069635,,,,,,,,
AVVSQNSSKTVTKFD,nt,A,50,true,"HUNTER N-terminome: legumain, GluC and trypsin",119,31951383,"MaxQuant score",107.6600000,,,,,,
AVVSQNSSKTVTKFDHCF,nta,A,50,true,"Arabidopsis translation initiation landscape - NTA",167a,35069635,,,,,,,,
AVVSQNSSK,nta,A,50,true,"Characterization plant N-terminal acetylation",6,22223895,"MASCOT Score",71.6300000,,,,,,
SSDGFLYCEGTK,sno,C,77,false,"Site-specific nitrosomeproteomic id - gsnor1-3",90a,25699590,XCorr,2.9384649,,,,,0.061149999499321,-5.5732744
SSDGFLYCEGTK,sno,C,77,false,"Site-specific nitrosomeproteomic id - gsnor1-3",90b,25699590,XCorr,3.0700000,,,,,0.026750000193715,-5.5000000
SSDGFLYCEGTK,sno,C,77,false,"hot5-4 / wildtype, FAT-switch S-nitrosoproteome",169,37277371,,,,0.7451176,0.0021352,YES,,
SSDGFLYCEGTK,so,C,77,false,"Arabidopsis S-sulfenylation chemoproteomics",108,31578252,"pFind PSM Score",0.3486300,,1.6393400,,,,-1.0587403
SSDGFLYCEGTK,so,C,77,false,"S-sulfenylation site detection using YAP1C",110,32714340,,,,,,,,
SLGCGAVLVSGNELR,acy,C,141,false,"Arabidopsis S-acylation atlas - Meristem",163a,35681017,,,,,,,,
SLGCGAVLVSGNELR,sno,C,141,false,"Site-specific nitrosomeproteomic id - gsnor1-3",90a,25699590,XCorr,4.3969755,,,,,1.0600000166505E-7,-4.4429300
SLGCGAVLVSGNELR,sno,C,141,false,"Site-specific nitrosomeproteomic id - gsnor1-3",90b,25699590,XCorr,3.0400000,,,,,0.00032809999538586,-7.6800000
SLGCGAVLVSGNELR,so,C,141,false,"Arabidopsis S-sulfenylation chemoproteomics",108,31578252,"pFind PSM Score",0.0010366,,1.0874400,,,,-1.2459734
SLGCGAVLVSGNELR,so,C,141,false,"S-sulfenylation site detection using YAP1C",110,32714340,,,,,,,,
CIFNGNGK,ox,C,164,false,"OxiTRAQ Arabidopsis - 5 mM H2O2 versus control",47,24376095,,,,0.0214832,0.1769452,NO,,
AGFDPTKCIFNGNGK,so,C,164,false,"Arabidopsis S-sulfenylation chemoproteomics",108,31578252,"pFind PSM Score",0.0045251,,0.9858200,,,,-1.1706789
CIFNGNGK,so,C,164,false,"S-sulfenylation site detection using YAP1C",110,32714340,,,,,,,,
LVGAHCHLGSTITK,sno,C,263,false,"Site-specific nitrosomeproteomic id - gsnor1-3",90b,25699590,XCorr,2.5000000,,,,,0.34439998865128,-4.1800000
LVGAHCHLGSTITK,so,C,263,false,"Arabidopsis S-sulfenylation chemoproteomics",108,31578252,"pFind PSM Score",0.0006040,,1.1127000,,,,1.2552922
LVGAHCHLGSTITK,so,C,263,false,"S-sulfenylation site detection using YAP1C",110,32714340,,,,,,,,
SLIANTCCFVNHVTGVK,so,C,350,false,"S-sulfenylation site detection using YAP1C",110,32714340,,,,,,,,
FDVVGPVCESADFLGK,sno,C,411,false,"Site-specific nitrosomeproteomic id - gsnor1-3",90a,25699590,XCorr,2.3738370,,,,,1.0930000371445E-6,-4.5585018
FDVVGPVCESADFLGK,sno,C,411,false,"Site-specific nitrosomeproteomic id - gsnor1-3",90b,25699590,XCorr,2.9410813,,,,,0.012339999899268,-7.0754335
FDVVGPVCESADFLGK,sno,C,411,false,"hot5-4 / wildtype, FAT-switch S-nitrosoproteome",169,37277371,,,,,,,,
FDVVGPVCESADFLGK,so,C,411,false,"S-sulfenylation site detection using YAP1C",110,32714340,,,,,,,,
