Peptide,PTM,ModifiedAA,ModifiedPosition,PeptideUniqueToGene,ExperimentDesc,ExpID,PubmedID,ScoreType,IdentScore,LocProb,Log2FChange,PQ-val,QuantSig,PEP,MassErrorPPM
GITCSGSR,sno,C,68,true,"hot5-4 / wildtype, FAT-switch S-nitrosoproteome",169,37277371,,,,,,,,
TDNNINQPIILASNDFHQENK,ph,S,340,true,"TOR Kinase and ABA Receptor",100,29290610,XCorr,3.0797877,1.0000000,,,,0.0050539998337626,
TDNNINQPIILASNDFHQENK,ph,S,340,true,"Tissue atlas Arabidopsis - ProteomicsDB",114,32188942,"MaxQuant score",161.6300000,1.0000000,,,,1.9384599618506E-30,
SVQNPPLVETK,ph,S,349,true,"TOR Kinase and ABA Receptor",100,29290610,XCorr,2.1043258,1.0000000,,,,0.0089760003611445,
SVQNPPLVETK,ph,S,349,true,"Tissue atlas Arabidopsis - ProteomicsDB",114,32188942,"MaxQuant score",135.8900000,1.0000000,,,,0,
SVQNPPLVETKK,ub,K,359,true,"Ubiquitination Membrane Proteins",120,33585938,,,,,,,,
KLDTSLSMNLRPPPSER,ph,S,366,true,"STN8 phosphoproteome",38,21768351,"MASCOT Score",46.3100000,,,,,,
KLDTSLSMNLRPPPSER,ph,S,366,true,"PAMP-triggered phosphorylation",48,24601666,"MASCOT Score",38.6100000,,,,,,
KLDTSLSMNLRPPPSER,ph,S,366,true,"Chloroplast kinase substrates",60,19376835,"MASCOT Score",44.7100000,,,,,,-0.4021160
KLDTSLSMNLRPPPSER,ph,S,366,true,"atm and atr DNA damage response",88,25561503,"MASCOT Score",28.0000000,0.9990000,,,,,0.0300000
KLDTSLSMNLRPPPSER,ph,S,366,true,"Tissue atlas Arabidopsis - ProteomicsDB",114,32188942,"MaxQuant score",183.0900000,0.9996690,,,,2.6670200757445E-30,
LDTSLSMNLRPPPSER,ph,S,366,true,"Arabidopsis root NAA phosphoproteome",18a,27643528,"MaxQuant Score",51.9710000,0.9000000,,,,0.00010699999984354,-0.4520000
LDTSLSMNLRPPPSER,ph,S,366,true,"TOR Kinase and ABA Receptor",100,29290610,XCorr,3.0815771,0.9213000,,,,4.7969999286579E-5,
KLDTSLSMNLRPPPSER,ph,S,374,true,"Tissue atlas Arabidopsis - ProteomicsDB",114,32188942,"MaxQuant score",45.5460000,0.9993510,,,,0.011213099583983,
HKSFDDDDSTMR,ph,S,379,true,"Plasmamembrane phosphorylation",20,15308754,,,,,,,,
HKSFDDDDSTMR,ph,S,379,true,"Sucrose-induced phosphorylation",24,17586839,,,,,,,,
HKSFDDDDSTMR,ph,S,379,true,"Ph protein kinases and peptide chip analysis",27,18433157,,,,,,,,
HKSFDDDDSTMR,ph,S,379,true,"Ethylene-regulated phosphorylation ein2 mutant",30,19253305,"MASCOT Score",34.7826000,,,,,,-16.6471100
HKSFDDDDSTMR,ph,S,379,true,"Phytohormone-responsive phosphoproteins",34,20374526,"MASCOT Score",50.0000000,,,,,,-3.3620900
HKSFDDDDSTMR,ph,S,379,true,"Tyrosine phosphorylation in Arabidopsis",59,18463617,"MASCOT Score",45.0000000,,,,,,-0.5872529
HKSFDDDDSTMR,ph,S,379,true,"Chloroplast kinase substrates",60,19376835,"MASCOT Score",33.3600000,,,,,,0.2204770
HKSFDDDDSTMR,ph,S,379,true,"srk2dei ABA signaling phopshoproteomics",83,23572148,"MASCOT Score",41.0000000,,,,,,-0.0010000
HKSFDDDDSTMR,ph,S,379,true,"LAXIC - mannitol vs control",84b,23660473,XCorr,2.6600000,0.9990000,,,,0.0012709000147879,
HKSFDDDDSTMR,ph,S,379,true,"SnRK2 protein kinase substrates",85,23776212,XCorr,2.9720948,1.0000000,,,,0.00206463993527,
HKSFDDDDSTMR,ph,S,379,true,"atm and atr DNA damage response",88,25561503,"MASCOT Score",48.0000000,1.0000000,,,,,-0.1200000
HKSFDDDDSTMR,ph,S,379,true,"TOR Kinase and ABA Receptor",100,29290610,XCorr,3.1811497,1.0000000,,,,0.0010659999679774,
HKSFDDDDSTMR,ph,S,379,true,"Phospho cell culture sucrose/TOR",109,30833711,,,1.0000000,,,,,
HKSFDDDDSTMR,ph,S,379,true,"Tissue atlas Arabidopsis - ProteomicsDB",114,32188942,"MaxQuant score",162.7900000,1.0000000,,,,6.2804200728905E-10,
SFDDDDSTMR,ph,S,379,true,"srk2dei ABA signaling phopshoproteomics",83,23572148,"MASCOT Score",25.0000000,,,,,,-0.0009000
SFDDDDSTMR,ph,S,379,true,"atm and atr DNA damage response",88,25561503,"MASCOT Score",30.0000000,1.0000000,,,,,-0.0400000
SFDDDDSTMR,ph,S,379,true,"TOR Kinase and ABA Receptor",100,29290610,XCorr,3.4863768,1.0000000,,,,0.00016120000509545,
SFDDDDSTMR,ph,S,385,true,"Tissue atlas Arabidopsis - ProteomicsDB",114,32188942,"MaxQuant score",129.7400000,0.9799110,,,,1.1083399840572E-5,
ALEYLHEVCSPSIVHK,ph,S,540,true,"Tissue atlas Arabidopsis - ProteomicsDB",114,32188942,"MaxQuant score",68.4900000,0.9306660,,,,0.00015131400141399,
SRSEQSLVR,ph,S,627,false,"atm and atr DNA damage response",88,25561503,"MASCOT Score",27.0000000,1.0000000,,,,,0.0900000
GLYPVKSLSR,ac,K,660,false,"Quantitative Acetylproteomics",101,29440448,,,,,,,,
RTVGVGSGSSGVNDYM,ph,S,708,true,"srk2dei ABA signaling phopshoproteomics",83,23572148,"MASCOT Score",81.0000000,,,,,,-0.0010000
TVGVGSGSSGVNDYM,ph,S,708,true,"Tissue atlas Arabidopsis - ProteomicsDB",114,32188942,"MaxQuant score",117.7500000,0.9775200,,,,1.1193100135642E-6,
RTVGVGSGSSGVNDYM,ph,S,710,true,"srk2dei ABA signaling phopshoproteomics",83,23572148,"MASCOT Score",34.0000000,,,,,,0.0012000
RTVGVGSGSSGVNDYM,ph,S,710,true,"Tissue atlas Arabidopsis - ProteomicsDB",114,32188942,"MaxQuant score",189.7700000,0.7952120,,,,7.2213802079856E-36,
TVGVGSGSSGVNDYM,ph,S,710,true,"LAXIC - ABA stress",84a,23660473,XCorr,3.4100000,0.9150000,,,,0.00011249200179009,
TVGVGSGSSGVNDYM,ph,S,710,true,"atm and atr DNA damage response",88,25561503,"MASCOT Score",69.0000000,0.9560000,,,,,-0.2300000
RTVGVGSGSSGVNDYM,ph,S,711,true,"srk2dei ABA signaling phopshoproteomics",83,23572148,"MASCOT Score",71.0000000,,,,,,-0.0009000
