Peptide,PTM,ModifiedAA,ModifiedPosition,PeptideUniqueToGene,ExperimentDesc,ExpID,PubmedID,ScoreType,IdentScore,LocProb,Log2FChange,PQ-val,QuantSig,PEP,MassErrorPPM
AVLRSSCSSTRYPE,nt,A,57,true,"N-terminal ChaFRADIC",92,26010716,"MASCOT Score",23.5600000,,,,,0.0014319999609143,
SSCSSTRYPE,nt,S,61,true,"N-terminal ChaFRADIC",92,26010716,"MASCOT Score",29.4200000,,,,,3.4450000384822E-5,
SSCSSTR,sno,C,63,true,"hot5-4 / wildtype, FAT-switch S-nitrosoproteome",169,37277371,,,,,,,,
VVTAGGVELTSQKDVIE,nt,V,76,true,"N-terminal ChaFRADIC",92,26010716,"MASCOT Score",60.0200000,,,,,3.7709999567426E-9,
VVTAGGVE,nt,V,76,true,"N-terminal ChaFRADIC",92,26010716,"MASCOT Score",49.7900000,,,,,0.00056229997426271,
VVTAGGVE,nt,V,76,true,"Arg/N-end rule seed, prt6 vs. Wt",99,29168982,"MASCOT Score",66.4400000,,-0.4185291,0.1498385,NO,0.0076939999125898,0.0736897
AGGVELTSQKDVIE,nt,A,79,true,"N-terminal ChaFRADIC",92,26010716,"MASCOT Score",22.4400000,,,,,6.2859999161446E-6,
GGVELTSQKDVIE,nt,G,80,true,"N-terminal ChaFRADIC",92,26010716,"MASCOT Score",29.5500000,,,,,0.0024109999649227,
DVIEASVNLTITAVEHNYFTVK,ng,N,96,true,"ER-associatied N-glycan degradation chilling stres",133,27558752,,,,,,,,
TLISSAITNQETCLDGFSHDDADK,sno,C,178,true,"hot5-4 / wildtype, FAT-switch S-nitrosoproteome",169,37277371,,,,-0.3975239,0.0770885,NO,,
GQIHVEHMCSNALAMIK,sno,C,206,true,"Site-specific nitrosomeproteomic id - gsnor1-3",90b,25699590,XCorr,2.3800000,,,,,0.00017929999739863,-7.0300000
NMTDTDIANFEQK,ng,N,215,true,"Conserved N-glycosylation",74,22633491,"MaxQuant Score",186.7300000,1.0000000,,,,1.2339999977065E-31,-0.9110000
NMTDTDIANFEQK,ng,N,215,true,"ER-associatied N-glycan degradation chilling stres",133,27558752,,,,,,,,
NMTDTDIANFEQK,ng,N,215,true,"N-linked Glycan Micro-heterogeneity Arabidopsis",134,29237727,,,,,,,,
NMTDTDIANFEQK,ng,N,215,true,"UDP-GlcNAc transporter glycopeptide analysis",135,30224661,,,,,,,3.2314790587407E-5,0.7000000
LQGSGVKADATVAAD,nt,L,273,true,"HUNTER N-terminome: legumain, GluC and trypsin",119,31951383,"MaxQuant score",73.8480000,,,,,,
QGSGVKADATVAADGSGTFKTVAAAVAAAPENSNKR,nt,Q,274,true,"HUNTER N-terminome: legumain, GluC and trypsin",119,31951383,"MaxQuant score",131.9900000,,,,,,
QGSGVKADATVAADGSGTFKTVAAAVAAAPEN,nt,Q,274,true,"HUNTER N-terminome: legumain, GluC and trypsin",119,31951383,"MaxQuant score",,,,,,,
QGSGVKADATVAADGSGTFKTVAAAVAAAPE,nt,Q,274,true,"HUNTER N-terminome: legumain, GluC and trypsin",119,31951383,"MaxQuant score",61.1120000,,,,,,
QGSGVKADATVAAD,nt,Q,274,true,"HUNTER N-terminome: legumain, GluC and trypsin",119,31951383,"MaxQuant score",122.7000000,,,,,,
TVAAAVAAAPENSNKR,ac,K,308,true,"Quantitative Acetylproteomics",101,29440448,,,,,,,,
DITFQNTAGPSKHQAVALR,ac,K,384,false,"Quantitative Acetylproteomics",101,29440448,,,,,,,,
RPNSGQKNMVTAQGR,ac,K,455,false,"Quantitative Acetylproteomics",101,29440448,,,,,,,,
