Peptide,PTM,ModifiedAA,ModifiedPosition,PeptideUniqueToGene,ExperimentDesc,ExpID,PubmedID,ScoreType,IdentScore,LocProb,Log2FChange,PQ-val,QuantSig,PEP,MassErrorPPM
SQASEQWVPVAADDK,ph,S,22,true,"Tissue atlas Arabidopsis - ProteomicsDB",114,32188942,"MaxQuant score",137.3200000,0.9992290,,,,9.0889102466463E-7,
NSYGRGNDEHSPVQAYVNK,me1,R,64,true,"Arabidopsis protein methylome",123,31809900,"MaxQuant Score",85.3620000,1.0000000,,,,2.8032500332239E-15,-0.2814500
GNDEHSPVQAYVNK,ph,S,70,true,"Tissue atlas Arabidopsis - ProteomicsDB",114,32188942,"MaxQuant score",143.3000000,1.0000000,,,,7.1422499559048E-7,
SLEDGIGSTKQPDDGAAAGDNK,ph,S,94,true,"Tissue atlas Arabidopsis - ProteomicsDB",114,32188942,"MaxQuant score",188.0700000,1.0000000,,,,0,
SLEDGIGSTK,ph,S,94,true,"atm and atr DNA damage response",88,25561503,"MASCOT Score",62.0000000,1.0000000,,,,,-1.1900000
KSLEDGIGSTKQPDDGAAAGDNK,ph,S,101,true,"Tissue atlas Arabidopsis - ProteomicsDB",114,32188942,"MaxQuant score",134.6100000,0.9114910,,,,2.0546899468418E-29,
STNVSGGSFVSSECEDKDGAK,ph,S,129,true,"Tissue atlas Arabidopsis - ProteomicsDB",114,32188942,"MaxQuant score",78.3540000,0.9547620,,,,2.104349914589E-5,
VELSSVEDQKSAPK,ph,S,180,true,"Tissue atlas Arabidopsis - ProteomicsDB",114,32188942,"MaxQuant score",144.0800000,1.0000000,,,,1.229180043083E-6,
GIVLKPNLLVLSR,ph,S,218,true,"Tissue atlas Arabidopsis - ProteomicsDB",114,32188942,"MaxQuant score",146.6700000,1.0000000,,,,2.8169401389277E-7,
LGLHQDKDESENSIR,ub,K,366,true,"Arabidopsis ubiquitination COFRADIC",40,26744219,"MaxQuant Score",75.9110000,1.0000000,,,,1.597000050424E-6,-0.0930000
