Peptide,PTM,ModifiedAA,ModifiedPosition,PeptideUniqueToGene,ExperimentDesc,ExpID,PubmedID,ScoreType,IdentScore,LocProb,Log2FChange,PQ-val,QuantSig,PEP,MassErrorPPM
ATATMATAAGAAALLYYTLNR,ph,T,8,true,"Brassinosteroid-Regulated Phosphorylation Dynamics",94,26187819,"MaxQuant Score",46.1450000,0.8710000,,,,0.043999999761581,0.5680000
ATATMATAAGAAALLYYTLNR,ph,Y,17,true,"Brassinosteroid-Regulated Phosphorylation Dynamics",94,26187819,"MaxQuant Score",46.1450000,0.9990000,,,,0.043999999761581,0.5680000
ATATMATAAGAAALLYYTLNR,ph,Y,18,true,"Brassinosteroid-Regulated Phosphorylation Dynamics",94,26187819,"MaxQuant Score",46.1450000,0.9990000,,,,0.043999999761581,0.5680000
ATATMATAAGAAALLYYTLNR,ph,T,19,true,"Brassinosteroid-Regulated Phosphorylation Dynamics",94,26187819,"MaxQuant Score",46.1450000,0.9980000,,,,0.043999999761581,0.5680000
LPSMATAK,ph,S,366,true,"Tissue atlas Arabidopsis - ProteomicsDB",114,32188942,"MaxQuant score",74.6000000,0.9923180,,,,0.0033850900363177,
RAQSMLTR,ph,S,397,true,"Tissue atlas Arabidopsis - ProteomicsDB",114,32188942,"MaxQuant score",157.6400000,0.9999400,,,,5.2376198982244E-30,
SEAECSNYEETSPR,ph,T,469,true,"Tissue atlas Arabidopsis - ProteomicsDB",114,32188942,"MaxQuant score",276.7500000,0.7978200,,,,0,
SEAECSNYEETSPR,ph,S,470,true,"Large-scale phosphorylation discovery",44,23111157,XCorr,5.3770000,,,,,,
SEAECSNYEETSPR,ph,S,470,true,"atm and atr DNA damage response",88,25561503,"MASCOT Score",70.0000000,0.9980000,,,,,-1.0800000
SEAECSNYEETSPR,ph,S,470,true,"TOR Kinase and ABA Receptor",100,29290610,XCorr,5.6231079,0.9999000,,,,1.1000000021966E-8,
SEAECSNYEETSPR,ph,S,470,true,"Lateral root-induction - NAA vs control",106,23328941,"MASCOT Score",38.0000000,,,,,,
SEAECSNYEETSPR,ph,S,470,true,"Tissue atlas Arabidopsis - ProteomicsDB",114,32188942,"MaxQuant score",381.5000000,0.9663350,,,,0,
