Peptide,PTM,ModifiedAA,ModifiedPosition,PeptideUniqueToGene,ExperimentDesc,ExpID,PubmedID,ScoreType,IdentScore,LocProb,Log2FChange,PQ-val,QuantSig,PEP,MassErrorPPM
SVSYDSRAITIN,nt,S,33,true,"HUNTER N-terminome: legumain, GluC and trypsin",119,31951383,"MaxQuant score",107.2400000,,,,,,
SVSYDSR,nt,S,33,true,"N-terminal ChaFRADIC",92,26010716,"MASCOT Score",30.0800000,,,,,0.053679998964071,
LCEPALVSGEPTR,sno,C,349,true,"hot5-4 / wildtype, FAT-switch S-nitrosoproteome",169,37277371,,,,,,,,
EPALVSGEPTR,nt,E,350,true,"Arg/N-end rule seed, prt6 vs. Wt",99,29168982,"MASCOT Score",32.0300000,,-0.5504775,0.0298776,NO,0.064470000565052,0.2138804
VKVDANEGFLR,nt,V,484,true,"HUNTER N-terminome: legumain, GluC and trypsin",119,31951383,"MaxQuant score",55.2610000,,,,,,
VDANEGFLR,nt,V,486,true,"N-terminal ChaFRADIC",92,26010716,"MASCOT Score",24.3500000,,,,,0.0021780000533909,
SLSGSSSVE,nt,S,605,true,"Arg/N-end rule seed, prt6 vs. Wt",99,29168982,"MASCOT Score",51.7100000,,-0.4715685,0.0363536,NO,0.011049999855459,-0.7351221
SGSSSVEWAE,nt,S,607,true,"N-terminal ChaFRADIC",92,26010716,"MASCOT Score",54.4900000,,,,,0.0015829999465495,
AVGSCSECSYTGTFREDK,acy,C,674,true,"Arabidopsis S-acylation atlas - Stem",163f,35681017,,,,,,,,
AVGSCSECSYTGTFR,ox,C,674,true,"Bicarbonate Induced Redox Changes - 5 min",117a,28184230,,,,-0.8365013,,YES,,
AVGSCSECSYTGTFREDK,acy,C,677,true,"Arabidopsis S-acylation atlas - Stem",163f,35681017,,,,,,,,
AVGSCSECSYTGTFR,ox,C,677,true,"Bicarbonate Induced Redox Changes - 5 min",117a,28184230,,,,-0.8365013,,YES,,
NCGEASQR,sno,C,692,false,"hot5-4 / wildtype, FAT-switch S-nitrosoproteome",169,37277371,,,,,,,,
AHLQCGPGQK,sno,C,771,true,"hot5-4 / wildtype, FAT-switch S-nitrosoproteome",169,37277371,,,,-0.8031690,0.0000775,YES,,
FASFGTPE,nt,F,782,true,"N-terminal ChaFRADIC",92,26010716,"MASCOT Score",35.2200000,,,,,0.027739999815822,
FASFGTPE,nt,F,782,true,"Arg/N-end rule seed, prt6 vs. Wt",99,29168982,"MASCOT Score",57.6200000,,0.5384357,0.1174936,NO,0.010150000452995,0.0311926
FASFGTPEGTCGSYR,sno,C,792,true,"hot5-4 / wildtype, FAT-switch S-nitrosoproteome",169,37277371,,,,-0.7318991,0.0015274,YES,,
